Peptide,PTM,ModifiedAA,ModifiedPosition,PeptideUniqueToGene,ExperimentDesc,ExpID,PubmedID,ScoreType,IdentScore,LocProb,Log2FChange,PQ-val,QuantSig,PEP,MassErrorPPM
NDEVSGVR,ph,S,138,true,"atm and atr DNA damage response",88,25561503,"MASCOT Score",36.0000000,1.0000000,,,,,0.3200000
NDEVSGVR,ph,S,138,true,"Tissue atlas Arabidopsis - ProteomicsDB",114,32188942,"MaxQuant score",106.4000000,1.0000000,,,,0.0040607298724353,
LLHNRSESPQWR,ph,S,313,true,"atm and atr DNA damage response",88,25561503,"MASCOT Score",25.0000000,1.0000000,,,,,-0.1600000
LLHNRSESPQWR,ph,S,313,true,"Phospho cell culture sucrose/TOR",109,30833711,,,1.0000000,,,,,
SESPQWR,ph,S,313,true,"Tissue atlas Arabidopsis - ProteomicsDB",114,32188942,"MaxQuant score",103.7700000,1.0000000,,,,2.6891499146586E-5,
LLHNRSESPQWR,ph,S,315,true,"atm and atr DNA damage response",88,25561503,"MASCOT Score",25.0000000,1.0000000,,,,,-0.1600000
SESPQWR,ph,S,315,true,"Tissue atlas Arabidopsis - ProteomicsDB",114,32188942,"MaxQuant score",146.5800000,1.0000000,,,,7.9576602729503E-5,
MHVDEAETSR,ph,T,334,true,"Tissue atlas Arabidopsis - ProteomicsDB",114,32188942,"MaxQuant score",138.6300000,0.8070780,,,,2.5318200641777E-5,
MHVDEAETSR,ph,S,335,true,"atm and atr DNA damage response",88,25561503,"MASCOT Score",40.0000000,1.0000000,,,,,0.0800000
QNGCYAESQEDR,ph,S,344,true,"Tissue atlas Arabidopsis - ProteomicsDB",114,32188942,"MaxQuant score",153.0900000,1.0000000,,,,1.5387399798783E-7,
IDSENAQPLDDMK,ph,S,351,true,"Tissue atlas Arabidopsis - ProteomicsDB",114,32188942,"MaxQuant score",254.9400000,1.0000000,,,,0,
