Peptide,PTM,ModifiedAA,ModifiedPosition,PeptideUniqueToGene,ExperimentDesc,ExpID,PubmedID,ScoreType,IdentScore,LocProb,Log2FChange,PQ-val,QuantSig,PEP,MassErrorPPM
VSVSPEASIVSDTKKLADASKSTN,nta,V,55,true,"HUNTER N-terminome: legumain, GluC and trypsin",119,31951383,"MaxQuant score",59.1630000,,,,,,
VSVSPEASIVSDTKKLAD,nta,V,55,true,"HUNTER N-terminome: legumain, GluC and trypsin",119,31951383,"MaxQuant score",72.4960000,,,,,,
VSVSPEASIVSDTK,nta,V,55,true,"Characterization plant N-terminal acetylation",6,22223895,"MASCOT Score",48.8800000,,,,,,
QFGPSLDNSNVTCEEYK,sno,C,306,true,"Site-specific nitrosomeproteomic id - gsnor1-3",90a,25699590,XCorr,3.0900000,,,,,0.050670001655817,-4.8900000
QFGPSLDNSNVTCEEYK,sno,C,306,true,"Site-specific nitrosomeproteomic id - gsnor1-3",90b,25699590,XCorr,3.2629848,,,,,0.052120000123978,-6.0158127
QFGPSLDNSNVTCEEYKEAVVK,ac,K,310,true,"Histone deacetylases - apicidin vs control",98a,29061669,"MaxQuant Score",130.5000000,1.0000000,-0.0230000,0.9015711,NO,0,
QFGPSLDNSNVTCEEYKEAVVK,ac,K,310,true,"Histone deacetylases- hda14 vs WT (low light)",98c,29061669,"MaxQuant Score",203.0600000,1.0000000,-0.0370000,0.9931160,NO,3.0000000586244E-25,
QFGPSLDNSNVTCEEYKEAVVK,ac,K,310,true,"Histone deacetylases substrates - hda14 vs WT",98e,29061669,"MaxQuant Score",52.2000000,1.0000000,0.1160000,0.9099133,NO,0.00020999999833293,
GKNEVEDK,ac,K,397,true,"Quantitative Acetylproteomics",101,29440448,,,,,,,,
QCAEHIMLVDLGR,sno,C,416,false,"Site-specific nitrosomeproteomic id - gsnor1-3",90a,25699590,XCorr,2.2200000,,,,,0.13490000367165,-7.5300000
QCAEHIMLVDLGR,sno,C,416,false,"Site-specific nitrosomeproteomic id - gsnor1-3",90b,25699590,XCorr,2.6800000,,,,,0.030220000073314,-6.8100000
QCAEHIMLVDLGR,so,C,416,false,"Arabidopsis S-sulfenylation chemoproteomics",108,31578252,"pFind PSM Score",0.2506100,,,,,,-0.9307023
