Peptide,PTM,ModifiedAA,ModifiedPosition,PeptideUniqueToGene,ExperimentDesc,ExpID,PubmedID,ScoreType,IdentScore,LocProb,Log2FChange,PQ-val,QuantSig,PEP,MassErrorPPM
ARTPRTPSGESAQWPLTGGVPSHVDDYK,ph,T,464,true,"srk2dei ABA signaling phopshoproteomics",83,23572148,"MASCOT Score",59.0000000,,,,,,-0.0024000
ARTPRTPSGESAQWPLTGGVPSHVDDYK,ph,T,464,true,"TOR Kinase and ABA Receptor",100,29290610,XCorr,5.4110937,0.9976000,,,,5.9839999266842E-6,
ARTPRTPSGESAQWPLTGGVPSHVDDYK,ph,T,464,true,"Phospho cell culture sucrose/TOR",109,30833711,,,0.9922190,,,,,
ARTPRTPSGESAQWPLTGGVPSHVDDYK,ph,T,464,true,"Tissue atlas Arabidopsis - ProteomicsDB",114,32188942,"MaxQuant score",156.3900000,0.9997060,,,,0,
ARTPRTPSGESAQWPLTGGVPSHVDDYK,ph,T,467,true,"srk2dei ABA signaling phopshoproteomics",83,23572148,"MASCOT Score",59.0000000,,,,,,-0.0024000
ARTPRTPSGESAQWPLTGGVPSHVDDYK,ph,T,467,true,"TOR Kinase and ABA Receptor",100,29290610,XCorr,5.4110937,0.9768000,,,,5.9839999266842E-6,
ARTPRTPSGESAQWPLTGGVPSHVDDYK,ph,T,467,true,"Phospho cell culture sucrose/TOR",109,30833711,,,0.8302170,,,,,
TPSGESAQWPLTGGVPSHVDDYK,ph,T,467,true,"srk2dei ABA signaling phopshoproteomics",83,23572148,"MASCOT Score",55.0000000,,,,,,0.0017000
TPSGESAQWPLTGGVPSHVDDYK,ph,T,467,true,"Lateral root-induction - NAA vs control",106,23328941,"MASCOT Score",34.0000000,,,,,,
TPSGESAQWPLTGGVPSHVDDYK,ph,T,467,true,"Tissue atlas Arabidopsis - ProteomicsDB",114,32188942,"MaxQuant score",304.8000000,0.9987500,,,,0,
ASESHSPDGEQNAVTETK,ph,S,776,true,"Lateral root-induction - NAA vs control",106,23328941,"MASCOT Score",23.0000000,,,,,,
ASESHSPDGEQNAVTETK,ph,S,776,true,"Tissue atlas Arabidopsis - ProteomicsDB",114,32188942,"MaxQuant score",101.5300000,0.7801760,,,,1.5238299511111E-6,
ASESHSPDGEQNAVTETK,ph,S,778,true,"Lateral root-induction - NAA vs control",106,23328941,"MASCOT Score",34.0000000,,,,,,
ASESHSPDGEQNAVTETK,ph,S,778,true,"Tissue atlas Arabidopsis - ProteomicsDB",114,32188942,"MaxQuant score",105.2200000,0.8882150,,,,1.2588000686264E-7,
ASESHSPDGEQNAVTETK,ph,S,780,true,"Tissue atlas Arabidopsis - ProteomicsDB",114,32188942,"MaxQuant score",144.2300000,0.9984060,,,,5.1397899682387E-17,
VLAAAADATFSHISVHK,ph,S,943,true,"Tissue atlas Arabidopsis - ProteomicsDB",114,32188942,"MaxQuant score",82.2670000,0.8768040,,,,5.8291800087318E-5,
LFDGASSDAQPK,ph,S,1047,true,"Tissue atlas Arabidopsis - ProteomicsDB",114,32188942,"MaxQuant score",63.2900000,0.7946360,,,,0.0032051301095635,
LFDGASSDAQPK,ph,S,1048,true,"Tissue atlas Arabidopsis - ProteomicsDB",114,32188942,"MaxQuant score",174.9400000,0.9918220,,,,3.7713201769926E-15,
AGETSAIASQAK,ph,S,1071,true,"Tissue atlas Arabidopsis - ProteomicsDB",114,32188942,"MaxQuant score",166.7000000,0.9892570,,,,5.3088200780143E-15,
TAELQDNAENFASMAHELAK,ph,S,1107,true,"Tissue atlas Arabidopsis - ProteomicsDB",114,32188942,"MaxQuant score",115.8800000,1.0000000,,,,1.0584899927044E-12,
