Peptide,PTM,ModifiedAA,ModifiedPosition,PeptideUniqueToGene,ExperimentDesc,ExpID,PubmedID,ScoreType,IdentScore,LocProb,Log2FChange,PQ-val,QuantSig,PEP,MassErrorPPM
TKKKGKHVSEM,nt,T,10,true,"Arabidopsis translation initiation landscape - NT",167b,35069635,,,,,,,,
EQKLEQEKSGTELPDDDSKKETDNNR,ub,K,125,true,"Arabidopsis ubiquitination COFRADIC",40,26744219,"MaxQuant Score",43.6960000,0.9870000,,,,0.000720200012438,0.0600000
ETDNNRLNDDDSKEETDNNR,ph,S,149,true,"TOR Kinase and ABA Receptor",100,29290610,XCorr,5.2329049,0.9765000,,,,4.1909997889888E-6,
LNDDDSKEETDNNR,ph,S,149,true,"atm and atr DNA damage response",88,25561503,"MASCOT Score",20.0000000,1.0000000,,,,,0.1200000
LNDDDSKEETDNNR,ph,S,149,true,"Tissue atlas Arabidopsis - ProteomicsDB",114,32188942,"MaxQuant score",202.8100000,1.0000000,,,,1.0385022919111E-41,
KIDELKGGR,ub,K,176,true,"Arabidopsis ubiquitination COFRADIC",40,26744219,"MaxQuant Score",90.0500000,1.0000000,,,,0.0020000000949949,-0.1590000
KIDELKGGR,ub,K,181,true,"Arabidopsis ubiquitination COFRADIC",40,26744219,"MaxQuant Score",130.9800000,1.0000000,,,,0.00030009998590685,-0.4950000
DTVSEEKTVEEIK,ph,S,210,true,"Tissue atlas Arabidopsis - ProteomicsDB",114,32188942,"MaxQuant score",269.0500000,1.0000000,,,,0,
TVEEIKSADKGK,ph,S,220,true,"Tissue atlas Arabidopsis - ProteomicsDB",114,32188942,"MaxQuant score",109.1400000,1.0000000,,,,2.3570399207529E-5,
LLKQSIHK,ph,S,312,true,"Tissue atlas Arabidopsis - ProteomicsDB",114,32188942,"MaxQuant score",80.8960000,1.0000000,,,,0.016666699200869,
IEQNKMR,ub,K,357,true,"Arabidopsis ubiquitination COFRADIC",40,26744219,"MaxQuant Score",70.9120000,1.0000000,,,,0.0089999996125698,0.7170000
EKKLLRPGFEGR,ub,K,366,true,"Arabidopsis ubiquitination COFRADIC",40,26744219,"MaxQuant Score",50.8970000,0.9480000,,,,0.017000000923872,0.2190000
KEGFINEGGN,ub,K,377,true,"Arabidopsis ubiquitination COFRADIC",40,26744219,"MaxQuant Score",147.9100000,1.0000000,,,,5.206000075475E-10,-0.2700000
