Peptide,PTM,ModifiedAA,ModifiedPosition,PeptideUniqueToGene,ExperimentDesc,ExpID,PubmedID,ScoreType,IdentScore,LocProb,Log2FChange,PQ-val,QuantSig,PEP,MassErrorPPM
AQANEPQSVPETNNVSSSSGQDTVLPSSPGR,ph,S,87,true,"TOR Kinase and ABA Receptor",100,29290610,XCorr,4.0796180,0.9579000,,,,0.00051729998085648,
AQANEPQSVPETNNVSSSSGQDTVLPSSPGR,ph,S,87,true,"Tissue atlas Arabidopsis - ProteomicsDB",114,32188942,"MaxQuant score",73.9160000,0.7615300,,,,7.3310897283352E-12,
ASNPSGNSEISPDASPVEEK,ph,S,184,true,"atm and atr DNA damage response",88,25561503,"MASCOT Score",32.0000000,0.9950000,,,,,-0.0400000
ASNPSGNSEISPDASPVEEK,ph,S,187,true,"atm and atr DNA damage response",88,25561503,"MASCOT Score",32.0000000,1.0000000,,,,,-0.0400000
ASNPSGNSEISPDASPVEEK,ph,S,187,true,"Tissue atlas Arabidopsis - ProteomicsDB",114,32188942,"MaxQuant score",331.5600000,1.0000000,,,,0,
ASNPSGNSEISPDASPVEEK,ph,S,191,true,"atm and atr DNA damage response",88,25561503,"MASCOT Score",32.0000000,1.0000000,,,,,-0.0400000
ASNPSGNSEISPDASPVEEK,ph,S,191,true,"Tissue atlas Arabidopsis - ProteomicsDB",114,32188942,"MaxQuant score",260.0600000,1.0000000,,,,0,
QSQLDILANKTPSAYDVVAAR,ph,T,207,true,"Tissue atlas Arabidopsis - ProteomicsDB",114,32188942,"MaxQuant score",80.3140000,0.9113760,,,,3.282749958089E-6,
ASNSSGNAEISPDASPVEEK,ph,S,228,true,"Tissue atlas Arabidopsis - ProteomicsDB",114,32188942,"MaxQuant score",174.5000000,1.0000000,,,,1.4573799624481E-35,
ASNSSGNAEISPDASPVEEK,ph,S,232,true,"Tissue atlas Arabidopsis - ProteomicsDB",114,32188942,"MaxQuant score",132.6700000,1.0000000,,,,2.9225100854549E-21,
EQGASSSSPFSENRR,ph,S,298,true,"Tissue atlas Arabidopsis - ProteomicsDB",114,32188942,"MaxQuant score",95.5700000,0.8685200,,,,2.4788700102363E-5,
EQGASSSSPFSENRR,ph,S,299,true,"atm and atr DNA damage response",88,25561503,"MASCOT Score",34.0000000,0.9820000,,,,,-0.2100000
EQGASSSSPFSENRR,ph,S,301,true,"atm and atr DNA damage response",88,25561503,"MASCOT Score",25.0000000,0.8070000,,,,,-0.1400000
EQGASSSSPFSENRR,ph,S,301,true,"Tissue atlas Arabidopsis - ProteomicsDB",114,32188942,"MaxQuant score",136.3400000,0.9550930,,,,8.2159499470436E-7,
EQGASSSSPFSENRR,ph,S,304,true,"atm and atr DNA damage response",88,25561503,"MASCOT Score",34.0000000,1.0000000,,,,,-0.2100000
HQNRSLQLEGPGGR,ph,S,322,true,"TOR Kinase and ABA Receptor",100,29290610,XCorr,3.9240975,1.0000000,,,,6.9189998612273E-5,
SLQLEGPGGR,ph,S,322,true,"atm and atr DNA damage response",88,25561503,"MASCOT Score",32.0000000,1.0000000,,,,,0.3900000
SLQLEGPGGR,ph,S,322,true,"Tissue atlas Arabidopsis - ProteomicsDB",114,32188942,"MaxQuant score",100.9300000,1.0000000,,,,0.00040702399564907,
GSPSHPSHDEFDRYPR,ph,S,360,true,"Phospho cell culture sucrose/TOR",109,30833711,,,0.9923200,,,,,
GSPSHPSHDEFDRYPR,ph,S,360,true,"Col-0 callus - FC Col-0 vs. Col-0 Xray",111a,31410901,,20.3800000,,-1.5997046,0.0000000,NO,,0.6381175
GSPSHPSHDEFDRYPR,ph,S,360,true,"Col-0 X-ray callus - FC Col-0 vs. Col-0 Xray",111b,31410901,,20.3800000,,-1.5997046,0.0000000,NO,,0.6381175
GSPSHPSHDEFDRYPR,ph,S,360,true,"atm callus - FC atm vs. atm Xray",111c,31410901,,20.3800000,,3.3431507,0.0000000,NO,,0.6381175
GSPSHPSHDEFDRYPR,ph,S,360,true,"atm-3 X-ray callus - FC atm vs. atm Xray",111d,31410901,,20.3800000,,3.3431507,0.0000000,NO,,0.6381175
GSPSHPSHDEFDRYPR,ph,S,360,true,"Tissue atlas Arabidopsis - ProteomicsDB",114,32188942,"MaxQuant score",131.5400000,0.9985180,,,,2.6101300676373E-8,
GSPSHPSHDEFDR,ph,S,360,true,"atm and atr DNA damage response",88,25561503,"MASCOT Score",43.0000000,0.8410000,,,,,-0.3800000
AHSLQMPSYAGGMNHDFVDYMYHNNPR,ph,S,377,true,"Tissue atlas Arabidopsis - ProteomicsDB",114,32188942,"MaxQuant score",47.9890000,0.9974600,,,,0.00010548499994911,
GQGQGSRISGEMGR,ph,S,412,true,"Tissue atlas Arabidopsis - ProteomicsDB",114,32188942,"MaxQuant score",80.8590000,0.9944110,,,,0.00011850600276375,
REIVSDVEDHQR,ph,S,457,true,"Tissue atlas Arabidopsis - ProteomicsDB",114,32188942,"MaxQuant score",274.4900000,1.0000000,,,,0,
EIVSDVEDHQR,ph,S,457,true,"atm and atr DNA damage response",88,25561503,"MASCOT Score",58.0000000,1.0000000,,,,,-0.2000000
EIVSDVEDHQR,ph,S,457,true,"Phospho cell culture sucrose/TOR",109,30833711,,,1.0000000,,,,,
NSNSTSESPIDKAPSKPEK,ph,S,560,true,"Tissue atlas Arabidopsis - ProteomicsDB",114,32188942,"MaxQuant score",113.8900000,0.9912220,,,,8.0297699045495E-11,
NSNSTSESPIDKAPSKPEK,ph,S,564,true,"Tissue atlas Arabidopsis - ProteomicsDB",114,32188942,"MaxQuant score",107.9800000,0.9905440,,,,1.7835699583912E-10,
LRSSVQDEELPVAR,ph,S,578,true,"Large-scale phosphorylation discovery",44,23111157,XCorr,3.3870000,,,,,,
LRSSVQDEELPVAR,ph,S,578,true,"TOR Kinase and ABA Receptor",100,29290610,XCorr,3.8477116,0.9912000,,,,0.0014430000446737,
LRSSVQDEELPVAR,ph,S,578,true,"Tissue atlas Arabidopsis - ProteomicsDB",114,32188942,"MaxQuant score",126.2500000,0.9899240,,,,9.8134796644445E-6,
SSVQDEELPVARGSPLHR,ph,S,591,true,"TOR Kinase and ABA Receptor",100,29290610,XCorr,3.2517333,1.0000000,,,,0.00021129999367986,
LMGYSTVSQVFK,ph,S,603,true,"Tissue atlas Arabidopsis - ProteomicsDB",114,32188942,"MaxQuant score",160.7800000,0.9995970,,,,1.6496999599713E-10,
VSQRPPSI,ph,S,614,true,"atm and atr DNA damage response",88,25561503,"MASCOT Score",30.0000000,1.0000000,,,,,0.1200000
VSQRPPSI,ph,S,614,true,"Tissue atlas Arabidopsis - ProteomicsDB",114,32188942,"MaxQuant score",134.5900000,1.0000000,,,,0.0049583199433982,
