Peptide,PTM,ModifiedAA,ModifiedPosition,PeptideUniqueToGene,ExperimentDesc,ExpID,PubmedID,ScoreType,IdentScore,LocProb,Log2FChange,PQ-val,QuantSig,PEP,MassErrorPPM
MESEGETAGKPMKNIVPQTCQICSDNVGKTVDGDR,nta,M,1,true,"HUNTER N-terminome: legumain, GluC and trypsin",119,31951383,"MaxQuant score",,,,,,,
MESEGETAGKPMK,ph,S,3,true,"Plasmamembrane phosphorylation",20,15308754,,,,,,,,
MESEGETAGKPMK,ph,S,3,true,"atm and atr DNA damage response",88,25561503,"MASCOT Score",28.0000000,0.9810000,,,,,-0.2000000
MESEGETAGKPMK,ph,S,3,true,"Tissue atlas Arabidopsis - ProteomicsDB",114,32188942,"MaxQuant score",211.3900000,1.0000000,,,,2.7082054640927E-40,
MESEGETAGK,ph,S,3,true,"atm and atr DNA damage response",88,25561503,"MASCOT Score",39.0000000,1.0000000,,,,,-0.7800000
MESEGETAGKPMK,ph,T,7,true,"atm and atr DNA damage response",88,25561503,"MASCOT Score",35.0000000,0.9970000,,,,,-1.5000000
EVSHNHLPR,ph,S,130,true,"atm and atr DNA damage response",88,25561503,"MASCOT Score",25.0000000,1.0000000,,,,,0.4600000
EVSHNHLPR,ph,S,130,true,"Tissue atlas Arabidopsis - ProteomicsDB",114,32188942,"MaxQuant score",107.0600000,1.0000000,,,,1.10704004328E-5,
LTSRQDTSGEFSAASPER,ph,S,139,true,"atm and atr DNA damage response",88,25561503,"MASCOT Score",64.0000000,0.9920000,,,,,-1.0300000
LTSRQDTSGEFSAASPER,ph,S,139,true,"TOR Kinase and ABA Receptor",100,29290610,XCorr,3.6754920,0.9130000,,,,0.0010029999539256,
LTSRQDTSGEFSAASPER,ph,S,139,true,"Tissue atlas Arabidopsis - ProteomicsDB",114,32188942,"MaxQuant score",119.3100000,0.9765990,,,,1.2143499367959E-13,
QDTSGEFSAASPER,nt,Q,141,true,"HUNTER N-terminome: legumain, GluC and trypsin",119,31951383,"MaxQuant score",70.6220000,,,,,,
LTSRQDTSGEFSAASPER,ph,T,143,true,"TOR Kinase and ABA Receptor",100,29290610,XCorr,3.6754920,0.9051000,,,,0.0010029999539256,
QDTSGEFSAASPER,ph,T,143,true,"atm and atr DNA damage response",88,25561503,"MASCOT Score",55.0000000,0.9400000,,,,,-0.8100000
QDTSGEFSAASPER,ph,T,143,true,"Tissue atlas Arabidopsis - ProteomicsDB",114,32188942,"MaxQuant score",99.4310000,0.7922460,,,,9.6075802957785E-7,
QDTSGEFSAASPER,ph,S,144,true,"Large-scale phosphorylation discovery",44,23111157,XCorr,3.1800000,,,,,,
QDTSGEFSAASPER,ph,S,144,true,"atm and atr DNA damage response",88,25561503,"MASCOT Score",102.0000000,1.0000000,,,,,-0.1200000
QDTSGEFSAASPER,ph,S,144,true,"Tissue atlas Arabidopsis - ProteomicsDB",114,32188942,"MaxQuant score",220.1400000,0.9998290,,,,0,
QDTSGEFSAASPERLSVSSTIAGGK,ph,S,151,true,"TOR Kinase and ABA Receptor",100,29290610,XCorr,2.8130763,0.8579000,,,,0.011920000426471,
LTSRQDTSGEFSAASPER,ph,S,151,true,"atm and atr DNA damage response",88,25561503,"MASCOT Score",64.0000000,1.0000000,,,,,-1.0300000
QDTSGEFSAASPER,ph,S,151,true,"Plasmamembrane phosphorylation",20,15308754,,,,,,,,
QDTSGEFSAASPER,ph,S,151,true,"Phosphorylation Early Elicitor Signaling",23,17317660,,,,,,,,
QDTSGEFSAASPER,ph,S,151,true,"Phytohormone-responsive phosphoproteins",34,20374526,"MASCOT Score",82.0000000,,,,,,2.4955600
QDTSGEFSAASPER,ph,S,151,true,"STN8 phosphoproteome",38,21768351,"MASCOT Score",90.6700000,,,,,,-1.0113600
QDTSGEFSAASPER,ph,S,151,true,"Tyrosine phosphorylation in Arabidopsis",59,18463617,"MASCOT Score",66.0000000,,,,,,-1.2174746
QDTSGEFSAASPER,ph,S,151,true,"Chloroplast kinase substrates",60,19376835,"MASCOT Score",93.8500000,,,,,,-1.7153100
QDTSGEFSAASPER,ph,S,151,true,"LAXIC - ABA stress",84a,23660473,XCorr,3.5700000,1.0000000,,,,2.0699999936369E-7,
QDTSGEFSAASPER,ph,S,151,true,"SnRK2 protein kinase substrates",85,23776212,XCorr,2.4455123,1.0000000,,,,7.4267802574468E-7,
QDTSGEFSAASPER,ph,S,151,true,"atm and atr DNA damage response",88,25561503,"MASCOT Score",76.0000000,1.0000000,,,,,-0.1200000
QDTSGEFSAASPER,ph,S,151,true,"TOR Kinase and ABA Receptor",100,29290610,XCorr,4.3189068,0.9999000,,,,1.4390000160347E-6,
QDTSGEFSAASPER,ph,S,151,true,"Lateral root-induction - NAA vs control",106,23328941,"MASCOT Score",62.0000000,,,,,,
QDTSGEFSAASPER,ph,S,151,true,"Tissue atlas Arabidopsis - ProteomicsDB",114,32188942,"MaxQuant score",379.6800000,1.0000000,,,,0,
LSVSSTIAGGK,ph,S,158,true,"Tissue atlas Arabidopsis - ProteomicsDB",114,32188942,"MaxQuant score",85.5220000,0.9144170,,,,0.00068541098153219,
LSVSSTIAGGKR,ph,S,159,true,"Tissue atlas Arabidopsis - ProteomicsDB",114,32188942,"MaxQuant score",118.6100000,0.7844530,,,,2.6519699531491E-5,
LSVSSTIAGGK,ph,T,160,true,"Tissue atlas Arabidopsis - ProteomicsDB",114,32188942,"MaxQuant score",196.2400000,0.9806290,,,,4.0925199211786E-18,
LSVSSTIAGGKR,ac,K,165,true,"Quantitative Acetylproteomics",101,29440448,,,,,,,,
LPYSSDVNQSPNRR,ph,S,170,true,"atm and atr DNA damage response",88,25561503,"MASCOT Score",30.0000000,0.9900000,,,,,-0.3600000
LPYSSDVNQSPNRR,ph,S,171,true,"SIRK1 exp - sirk1 mutant vs WT",86b,23820729,,,,-0.3045986,,NO,,
LPYSSDVNQSPNRR,ph,S,171,true,"SIRK1 exp - 35S:SIRK1 vs WT",86c,23820729,,,,2.4779362,,NO,,
LPYSSDVNQSPNRR,ph,S,171,true,"atm and atr DNA damage response",88,25561503,"MASCOT Score",30.0000000,0.9240000,,,,,-0.3600000
RLPYSSDVNQSPNRR,ph,S,176,true,"srk2dei ABA signaling phopshoproteomics",83,23572148,"MASCOT Score",26.0000000,,,,,,-0.0007000
RLPYSSDVNQSPNRR,ph,S,176,true,"atm and atr DNA damage response",88,25561503,"MASCOT Score",34.0000000,1.0000000,,,,,-0.6700000
LPYSSDVNQSPNRR,ph,S,176,true,"SIRK1 phosphorylation",86a,23820729,"MaxQuant Score",114.1200000,1.0000000,,,,0.064999997615814,6.7700000
LPYSSDVNQSPNRR,ph,S,176,true,"SIRK1 exp - sirk1 mutant vs WT",86b,23820729,,,,-0.3045986,,NO,,
LPYSSDVNQSPNRR,ph,S,176,true,"SIRK1 exp - 35S:SIRK1 vs WT",86c,23820729,,,,2.4779362,,NO,,
LPYSSDVNQSPNRR,ph,S,176,true,"atm and atr DNA damage response",88,25561503,"MASCOT Score",35.0000000,0.9990000,,,,,0.3000000
RLPYSSDVNQSPNR,ph,S,176,true,"atm and atr DNA damage response",88,25561503,"MASCOT Score",43.0000000,1.0000000,,,,,-0.5000000
RLPYSSDVNQSPNR,ph,S,176,true,"TOR Kinase and ABA Receptor",100,29290610,XCorr,2.8288045,1.0000000,,,,0.046900000423193,
RLPYSSDVNQSPNR,ph,S,176,true,"Tissue atlas Arabidopsis - ProteomicsDB",114,32188942,"MaxQuant score",280.5000000,1.0000000,,,,0,
LPYSSDVNQSPNR,ph,S,176,true,"Phosphorylation Early Elicitor Signaling",23,17317660,,,,,,,,
LPYSSDVNQSPNR,ph,S,176,true,"Chloroplast kinase substrates",60,19376835,"MASCOT Score",39.8100000,,,,,,-0.0792090
LPYSSDVNQSPNR,ph,S,176,true,"SnRK2 protein kinase substrates",85,23776212,XCorr,3.1702409,1.0000000,,,,0.003012330038473,
LPYSSDVNQSPNR,ph,S,176,true,"atm and atr DNA damage response",88,25561503,"MASCOT Score",59.0000000,1.0000000,,,,,-0.0100000
LPYSSDVNQSPNR,ph,S,176,true,"Lateral root-induction - NAA vs control",106,23328941,"MASCOT Score",40.0000000,,,,,,
LPYSSDVNQSPNR,ph,S,176,true,"Phosphorylation tonoplast membrane fraction",107,18686298,"MASCOT Score",59.0000000,,,,,,
MKQEKNTGPVSTQAASER,ub,K,205,true,"Ubiquitination Membrane Proteins",120,33585938,,,,,,,,
NTGPVSTQAASER,ph,S,211,true,"Plasmamembrane phosphorylation",20,15308754,,,,,,,,
NTGPVSTQAASER,ph,S,211,true,"STN8 phosphoproteome",38,21768351,"MASCOT Score",43.0000000,,,,,,
NTGPVSTQAASER,ph,S,211,true,"LAXIC - mannitol vs control",84b,23660473,XCorr,3.0000000,0.9530000,,,,0.027980199083686,
NTGPVSTQAASER,ph,S,211,true,"atm and atr DNA damage response",88,25561503,"MASCOT Score",70.0000000,0.9450000,,,,,-0.1500000
NTGPVSTQAASER,ph,S,211,true,"TOR Kinase and ABA Receptor",100,29290610,XCorr,5.0763221,0.8851000,,,,0.00043690000893548,
NTGPVSTQAASER,ph,S,211,true,"Lateral root-induction - NAA vs control",106,23328941,"MASCOT Score",38.0000000,,,,,,
NTGPVSTQAASER,ph,S,211,true,"Tissue atlas Arabidopsis - ProteomicsDB",114,32188942,"MaxQuant score",186.5600000,1.0000000,,,,2.4611500988035E-22,
NTGPVSTQAASER,ph,T,212,true,"Phosphorylation Early Elicitor Signaling",23,17317660,,,,,,,,
NTGPVSTQAASER,ph,T,212,true,"atm and atr DNA damage response",88,25561503,"MASCOT Score",42.0000000,1.0000000,,,,,-0.7300000
NTGPVSTQAASER,ph,T,212,true,"Lateral root-induction - NAA vs control",106,23328941,"MASCOT Score",33.0000000,,,,,,
NTGPVSTQAASER,ph,T,212,true,"Tissue atlas Arabidopsis - ProteomicsDB",114,32188942,"MaxQuant score",139.5000000,1.0000000,,,,0.00039843600825407,
NTGPVSTQAASER,ph,S,216,true,"Plasmamembrane phosphorylation",20,15308754,,,,,,,,
NTGPVSTQAASER,ph,S,216,true,"Phosphorylation Early Elicitor Signaling",23,17317660,,,,,,,,
NTGPVSTQAASER,ph,S,216,true,"STN8 phosphoproteome",38,21768351,"MASCOT Score",78.1200000,,,,,,-1.2429300
NTGPVSTQAASER,ph,S,216,true,"Chloroplast kinase substrates",60,19376835,"MASCOT Score",51.4000000,,,,,,-0.5851390
NTGPVSTQAASER,ph,S,216,true,"LAXIC - ABA stress",84a,23660473,XCorr,3.1800000,1.0000000,,,,0.0011589500354603,
NTGPVSTQAASER,ph,S,216,true,"LAXIC - mannitol vs control",84b,23660473,XCorr,3.0000000,0.9970000,,,,0.027980199083686,
NTGPVSTQAASER,ph,S,216,true,"SnRK2 protein kinase substrates",85,23776212,XCorr,2.2591882,0.9850000,,,,0.051158599555492,
NTGPVSTQAASER,ph,S,216,true,"atm and atr DNA damage response",88,25561503,"MASCOT Score",84.0000000,1.0000000,,,,,-0.1400000
NTGPVSTQAASER,ph,S,216,true,"TOR Kinase and ABA Receptor",100,29290610,XCorr,5.0763221,0.9832000,,,,0.00043690000893548,
NTGPVSTQAASER,ph,S,216,true,"Lateral root-induction - NAA vs control",106,23328941,"MASCOT Score",50.0000000,,,,,,
NTGPVSTQAASER,ph,S,216,true,"Tissue atlas Arabidopsis - ProteomicsDB",114,32188942,"MaxQuant score",233.4800000,1.0000000,,,,0,
GGVDIDASTDILADEALLNDEAR,ph,S,226,true,"Large-scale phosphorylation discovery",44,23111157,XCorr,4.1270000,,,,,,
GGVDIDASTDILADEALLNDEAR,ph,S,226,true,"Lateral root-induction - NAA vs control",106,23328941,"MASCOT Score",86.0000000,,,,,,
GGVDIDASTDILADEALLNDEAR,ph,T,227,true,"Phosphorylation Early Elicitor Signaling",23,17317660,,,,,,,,
GGVDIDASTDILADEALLNDEAR,ph,T,227,true,"TOR Kinase and ABA Receptor",100,29290610,XCorr,5.2112827,0.9920000,,,,1.7310000544057E-8,
GGVDIDASTDILADEALLNDEAR,ph,T,227,true,"Tissue atlas Arabidopsis - ProteomicsDB",114,32188942,"MaxQuant score",273.4200000,0.9655620,,,,0,
IDYLKDKVQTSFVK,ub,K,427,true,"Ubiquitination Membrane Proteins",120,33585938,,,,,,,,
VQTSFVKDRR,ub,K,434,true,"Ubiquitination Membrane Proteins",120,33585938,,,,,,,,
VQTSFVKDR,ub,K,434,true,"Ubiquitination Membrane Proteins",120,33585938,,,,,,,,
VQTSFVKDR,ub,K,434,true,"upl3 mutant / wildtype",168,35926874,"MaxQuant score",53.5970000,1.0000000,1.5791801,0.0564180,NO,0.01192170009017,0.9686200
INALVSKALK,ub,K,456,true,"Ubiquitination Membrane Proteins",120,33585938,,,,,,,,
INALVSKALK,ub,K,456,true,"upl3 mutant / wildtype",168,35926874,"MaxQuant score",57.1490000,1.0000000,0.3184615,,,0.015753900632262,0.0369600
ALKCPEEGWVMQDGTPWPGNNTR,ub,K,459,true,"Ubiquitination Membrane Proteins",120,33585938,,,,,,,,
ALKCPEEGWVMQDGTPWPGNNTR,ub,K,459,true,"upl3 mutant / wildtype",168,35926874,"MaxQuant score",122.6500000,1.0000000,0.9252399,,,4.5248500042325E-17,-1.8326000
QVCYVQFPQR,ox,C,573,true,"SPEAR - 10 mM H2O2 / mock",138a,34619326,,,,3.1601578,0.0456658,YES,,
HTDSTVPVFNLDDIEEGVEGAGFDDEK,ph,S,671,true,"Large-scale phosphorylation discovery",44,23111157,XCorr,7.0240000,,,,,,
ALLMSQMSLEKR,ph,S,702,true,"Tissue atlas Arabidopsis - ProteomicsDB",114,32188942,"MaxQuant score",95.4280000,0.9998710,,,,3.283490150352E-5,
EAIHVISCGYEDK,ox,C,743,false,"SPEAR - 10 mM H2O2 / mock",138a,34619326,,,,4.7140712,0.0001371,YES,,
