Peptide,PTM,ModifiedAA,ModifiedPosition,PeptideUniqueToGene,ExperimentDesc,ExpID,PubmedID,ScoreType,IdentScore,LocProb,Log2FChange,PQ-val,QuantSig,PEP,MassErrorPPM
VVNLSYNNLSGPIPEHLK,ng,N,205,true,"Conserved N-glycosylation",74,22633491,"MaxQuant Score",123.2900000,0.8800000,,,,2.5809999665609E-18,0.3540000
VVNLSYNNLSGPIPEHLK,ng,N,205,true,"UDP-GlcNAc transporter glycopeptide analysis",135,30224661,,,,,,,3.1019251794915E-16,0.7000000
KPQDFGSGVQDPEK,ph,S,320,true,"Phosphorylation Early Elicitor Signaling",23,17317660,,,,,,,,
KPQDFGSGVQDPEK,ph,S,320,true,"atm and atr DNA damage response",88,25561503,"MASCOT Score",47.0000000,1.0000000,,,,,-4.3200000
KPQDFGSGVQDPEK,ph,S,320,true,"TOR Kinase and ABA Receptor",100,29290610,XCorr,4.1337476,1.0000000,,,,0.0032679999712855,
KPQDFGSGVQDPEK,ph,S,320,true,"Tissue atlas Arabidopsis - ProteomicsDB",114,32188942,"MaxQuant score",238.4500000,1.0000000,,,,0,
CNHNFDLEDLLKASAEVLGK,ph,S,349,true,"Phosphorylation Early Elicitor Signaling",23,17317660,,,,,,,,
ASAEVLGK,ph,S,349,false,"Plasmamembrane phosphorylation",20,15308754,,,,,,,,
ASAEVLGK,ph,S,349,false,"Phosphorylation Early Elicitor Signaling",23,17317660,,,,,,,,
ASAEVLGK,ph,S,349,false,"Sucrose-induced phosphorylation",24,17586839,,,,,,,,
ASAEVLGK,ph,S,349,false,"Plasmembrane Ph Immune Responses",25,17651370,,,,,,,,
ASAEVLGK,ph,S,349,false,"Immuno-dot blot phosphorylation",31,19341826,"MASCOT Score",43.1300000,,,,,,10.7296000
ASAEVLGK,ph,S,349,false,"Phytohormone-responsive phosphoproteins",34,20374526,"MASCOT Score",50.0000000,,,,,,10.7581000
ASAEVLGK,ph,S,349,false,"Tyrosine phosphorylation in Arabidopsis",59,18463617,"MASCOT Score",47.0000000,,,,,,-0.4687165
ASAEVLGK,ph,S,349,false,"srk2dei ABA signaling phopshoproteomics",83,23572148,"MASCOT Score",44.0000000,,,,,,0.0004000
ASAEVLGK,ph,S,349,false,"LAXIC - mannitol vs control",84b,23660473,XCorr,2.0300000,1.0000000,-1.2490629,,NO,0.0014310600236058,
ASAEVLGK,ph,S,349,false,"SnRK2 protein kinase substrates",85,23776212,XCorr,3.0863461,1.0000000,,,,0.059298899024725,
ASAEVLGK,ph,S,349,false,"atm and atr DNA damage response",88,25561503,"MASCOT Score",58.0000000,1.0000000,,,,,1.7300000
ASAEVLGK,ph,S,349,false,"Phospho cell culture sucrose/TOR",109,30833711,,,1.0000000,,,,,
ASAEVLGK,ph,S,349,false,"Col-0 callus - FC Col-0 vs. Col-0 Xray",111a,31410901,,35.6000000,,0.2389819,0.0000000,NO,,-0.0113007
ASAEVLGK,ph,S,349,false,"Col-0 X-ray callus - FC Col-0 vs. Col-0 Xray",111b,31410901,,35.6000000,,0.2389819,0.0000000,NO,,-0.0113007
ASAEVLGK,ph,S,349,false,"atm callus - FC atm vs. atm Xray",111c,31410901,,31.6600000,,-1.6865110,0.0000000,NO,,-0.0674947
ASAEVLGK,ph,S,349,false,"atm-3 X-ray callus - FC atm vs. atm Xray",111d,31410901,,31.6600000,,-1.6865110,0.0000000,NO,,-0.0674947
ASAEVLGK,ph,S,349,false,"Tissue atlas Arabidopsis - ProteomicsDB",114,32188942,"MaxQuant score",114.9700000,1.0000000,,,,8.8670400145929E-5,
AYYYSKDEK,ub,K,413,false,"Ubiquitination Membrane Proteins",120,33585938,,,,,,,,
AYYYSKDEK,ub,K,413,false,"upl3 mutant / wildtype",168,35926874,"MaxQuant score",69.3750000,1.0000000,0.8914192,0.3521200,NO,0.017552800476551,-1.0263000
GDIKSSNILLTE,nt,G,468,true,"N-terminal ChaFRADIC",92,26010716,"MASCOT Score",26.5100000,,,,,0.15340000391006,
GDIKSSNILLTE,nta,G,468,true,"N-terminal ChaFRADIC",92,26010716,"MASCOT Score",26.5100000,,,,,0.15340000391006,
TSSEATSNVSE,ph,S,639,true,"atm and atr DNA damage response",88,25561503,"MASCOT Score",57.0000000,1.0000000,,,,,-0.0900000
