Peptide,PTM,ModifiedAA,ModifiedPosition,PeptideUniqueToGene,ExperimentDesc,ExpID,PubmedID,ScoreType,IdentScore,LocProb,Log2FChange,PQ-val,QuantSig,PEP,MassErrorPPM
GRVRTKTVKKSSRQVIE,nt,G,2,false,"Arabidopsis translation initiation landscape - NT",167b,35069635,,,,,,,,
TKTVKKSSR,ub,K,7,false,"Arabidopsis ubiquitination COFRADIC",40,26744219,"MaxQuant Score",99.7520000,1.0000000,,,,0.0089999996125698,-1.5910000
QVIEKYYSR,nt,Q,15,false,"HUNTER N-terminome: legumain, GluC and trypsin",119,31951383,"MaxQuant score",59.8000000,,,,,,
QVIEKYYSR,ac,K,19,false,"Histone deacetylases - apicidin vs control",98a,29061669,"MaxQuant Score",84.5000000,1.0000000,-0.1040000,0.5395106,NO,0.0060000000521541,
QVIEKYYSR,ac,K,19,false,"Histone deacetylases substrates - hda14 vs WT",98e,29061669,"MaxQuant Score",66.1000000,1.0000000,-0.0210000,0.9705100,NO,0.0049999998882413,
QVIEKYYSR,ub,K,19,false,"Arabidopsis ubiquitination COFRADIC",40,26744219,"MaxQuant Score",61.5930000,1.0000000,,,,0.0070000002160668,0.4890000
QVIEKYYSR,ub,K,19,false,"upl3 mutant / wildtype",168,35926874,"MaxQuant score",60.0640000,1.0000000,0.4243847,,,0.026689700782299,-1.8825000
MTLDFHTNKK,ac,K,32,false,"Quantitative Acetylproteomics",101,29440448,,,,,,,,
KILEEVAIIPSKR,ac,K,44,false,"Quantitative Acetylproteomics",101,29440448,,,,,,,,
ILEEVAIIPSKR,ac,K,44,false,"Quantitative Acetylproteomics",101,29440448,,,,,,,,
IAGFSTHLMK,mox,M,58,false,"cat2 Methionine oxidation - 3h stress",62b,25693801,"MASCOT Score",62.0000000,,-1.5189053,,NO,,
IAGFSTHLMKR,ac,K,59,false,"Quantitative Acetylproteomics",101,29440448,,,,,,,,
IQKGPVR,ub,K,63,false,"Arabidopsis ubiquitination COFRADIC",40,26744219,"MaxQuant Score",93.5930000,1.0000000,,,,0.018999999389052,1.0810000
GISLKLQEEERER,ub,K,72,false,"upl3 mutant / wildtype",168,35926874,"MaxQuant score",153.9500000,1.0000000,1.8623522,0.0593820,NO,7.2938999284844E-10,0.7841000
GISLKLQEEER,ub,K,72,false,"Arabidopsis ubiquitination COFRADIC",40,26744219,"MaxQuant Score",119.3900000,1.0000000,,,,2.528000031532E-8,-1.4010000
