Peptide,PTM,ModifiedAA,ModifiedPosition,PeptideUniqueToGene,ExperimentDesc,ExpID,PubmedID,ScoreType,IdentScore,LocProb,Log2FChange,PQ-val,QuantSig,PEP,MassErrorPPM
VAASASSSQLPLPQNPK,ph,S,21,true,"Tissue atlas Arabidopsis - ProteomicsDB",114,32188942,"MaxQuant score",213.9100000,0.9304890,,,,0,
KAPVTTPPLQNKATVLYIGR,ub,K,47,true,"Arabidopsis ubiquitination COFRADIC",40,26744219,"MaxQuant Score",56.7080000,1.0000000,,,,5.7709997940353E-15,0.5560000
KAPVTTPPLQNK,ph,T,51,true,"Tissue atlas Arabidopsis - ProteomicsDB",114,32188942,"MaxQuant score",49.4360000,0.8065050,,,,0.0095843998715281,
KAPVTTPPLQNK,ph,T,52,true,"Large-scale phosphorylation discovery",44,23111157,XCorr,3.3630000,,,,,,
KAPVTTPPLQNK,ph,T,52,true,"Tissue atlas Arabidopsis - ProteomicsDB",114,32188942,"MaxQuant score",205.8000000,0.9998270,,,,1.9003099979913E-30,
APVTTPPLQNK,ph,T,52,true,"TOR Kinase and ABA Receptor",100,29290610,XCorr,3.0418241,0.9925000,,,,0.014569999650121,
SVQIER,ph,S,158,false,"STN8 phosphoproteome",38,21768351,"MASCOT Score",46.9400000,,,,,,-0.5457830
IEAAGIEYECPELVGNTQPVPKR,ub,K,214,true,"Arabidopsis ubiquitination COFRADIC",40,26744219,"MaxQuant Score",74.2140000,1.0000000,,,,7.9439997095311E-23,-0.5700000
