Peptide,PTM,ModifiedAA,ModifiedPosition,PeptideUniqueToGene,ExperimentDesc,ExpID,PubmedID,ScoreType,IdentScore,LocProb,Log2FChange,PQ-val,QuantSig,PEP,MassErrorPPM
VEASDVSSADSDFIGR,ph,S,236,true,"atm and atr DNA damage response",88,25561503,"MASCOT Score",73.0000000,0.9990000,,,,,-0.6100000
VEASDVSSADSDFIGR,ph,S,236,true,"Tissue atlas Arabidopsis - ProteomicsDB",114,32188942,"MaxQuant score",188.4400000,1.0000000,,,,2.4596399913089E-27,
VEASDVSSADSDFIGR,ph,S,239,true,"atm and atr DNA damage response",88,25561503,"MASCOT Score",73.0000000,0.9280000,,,,,-0.6100000
VEASDVSSADSDFIGR,ph,S,239,true,"Tissue atlas Arabidopsis - ProteomicsDB",114,32188942,"MaxQuant score",233.4800000,0.9859470,,,,0,
VEASDVSSADSDFIGR,ph,S,240,true,"atm and atr DNA damage response",88,25561503,"MASCOT Score",90.0000000,0.9980000,,,,,-0.3600000
VEASDVSSADSDFIGR,ph,S,240,true,"Tissue atlas Arabidopsis - ProteomicsDB",114,32188942,"MaxQuant score",172.9100000,0.9608920,,,,2.133900056682E-19,
VEASDVSSADSDFIGR,ph,S,243,true,"atm and atr DNA damage response",88,25561503,"MASCOT Score",56.0000000,1.0000000,,,,,-1.3500000
VEASDVSSADSDFIGR,ph,S,243,true,"Tissue atlas Arabidopsis - ProteomicsDB",114,32188942,"MaxQuant score",206.8000000,0.9997390,,,,0,
SHSVSTILTPVSHK,ph,S,249,true,"atm and atr DNA damage response",88,25561503,"MASCOT Score",31.0000000,1.0000000,,,,,0.4000000
SHSVSTILTPVSHK,ph,S,249,true,"Tissue atlas Arabidopsis - ProteomicsDB",114,32188942,"MaxQuant score",244.3700000,0.9634010,,,,0,
SHSVSTILTPVSHK,ph,S,251,true,"atm and atr DNA damage response",88,25561503,"MASCOT Score",31.0000000,0.9340000,,,,,-0.5800000
SHSVSTILTPVSHK,ph,S,251,true,"Tissue atlas Arabidopsis - ProteomicsDB",114,32188942,"MaxQuant score",162.6400000,0.9920940,,,,2.0246599535811E-11,
SHSVSTILTPVSHK,ph,S,253,true,"atm and atr DNA damage response",88,25561503,"MASCOT Score",56.0000000,1.0000000,,,,,-0.9200000
SHSVSTILTPVSHK,ph,S,253,true,"Tissue atlas Arabidopsis - ProteomicsDB",114,32188942,"MaxQuant score",318.0400000,0.9992830,,,,0,
SHSVSTILTPVSHK,ph,T,257,true,"atm and atr DNA damage response",88,25561503,"MASCOT Score",56.0000000,1.0000000,,,,,-0.9200000
SHSVSTILTPVSHK,ph,T,257,true,"TOR Kinase and ABA Receptor",100,29290610,XCorr,4.0608544,0.9845000,,,,0.00010260000271956,
SHSVSTILTPVSHK,ph,T,257,true,"Tissue atlas Arabidopsis - ProteomicsDB",114,32188942,"MaxQuant score",210.2000000,0.9999100,,,,7.3708299223485E-43,
FASGPLGR,ph,S,273,true,"STN8 phosphoproteome",38,21768351,"MASCOT Score",47.8100000,,,,,,-0.9130040
FASGPLGR,ph,S,273,true,"atm and atr DNA damage response",88,25561503,"MASCOT Score",42.0000000,1.0000000,,,,,0.5700000
FASGPLGR,ph,S,273,true,"TOR Kinase and ABA Receptor",100,29290610,XCorr,2.4356489,1.0000000,,,,0.00512700015679,
FASGPLGR,ph,S,273,true,"Tissue atlas Arabidopsis - ProteomicsDB",114,32188942,"MaxQuant score",139.0200000,1.0000000,,,,0.0023734199348837,
MSDFLSGSLSAESPK,ph,S,299,true,"Tissue atlas Arabidopsis - ProteomicsDB",114,32188942,"MaxQuant score",113.1900000,0.8411210,,,,1.4796399909756E-6,
MSDFLSGSLSAESPK,ph,S,303,true,"Tissue atlas Arabidopsis - ProteomicsDB",114,32188942,"MaxQuant score",215.9300000,0.9216680,,,,0,
MSDFLSGSLSAESPK,ph,S,306,true,"srk2dei ABA signaling phopshoproteomics",83,23572148,"MASCOT Score",28.0000000,,,,,,0.0003000
MSDFLSGSLSAESPK,ph,S,306,true,"atm and atr DNA damage response",88,25561503,"MASCOT Score",74.0000000,1.0000000,,,,,-0.0100000
MSDFLSGSLSAESPK,ph,S,306,true,"TOR Kinase and ABA Receptor",100,29290610,XCorr,5.0164580,1.0000000,,,,3.3270000585617E-6,
MSDFLSGSLSAESPK,ph,S,306,true,"Tissue atlas Arabidopsis - ProteomicsDB",114,32188942,"MaxQuant score",225.7500000,0.9993220,,,,0,
MSDFLSGSLSAESPK,ph,S,306,true,"Touch-induced phosphorylation: 40s touch vs untouc",136,30291188,"MASCOT score",89.4200000,,-0.0897552,0.5729316,NO,,2.7489733
SGPLVAEK,ph,S,309,true,"atm and atr DNA damage response",88,25561503,"MASCOT Score",41.0000000,1.0000000,,,,,-0.1000000
SGPLVAEK,ph,S,309,true,"TOR Kinase and ABA Receptor",100,29290610,XCorr,2.7338099,1.0000000,,,,0.0022770001087338,
SGPLVAEK,ph,S,309,true,"Tissue atlas Arabidopsis - ProteomicsDB",114,32188942,"MaxQuant score",120.5200000,1.0000000,,,,3.5453400796646E-22,
FKFYSGQLGK,ph,S,324,true,"Tissue atlas Arabidopsis - ProteomicsDB",114,32188942,"MaxQuant score",155.6600000,1.0000000,,,,1.6460400047436E-6,
FYSGQLGK,ph,S,324,true,"atm and atr DNA damage response",88,25561503,"MASCOT Score",34.0000000,1.0000000,,,,,-0.7800000
FYSGQLGKITSKSGPLIGMGK,ub,K,329,true,"Arabidopsis ubiquitination by TUBEs",2,23667124,,,,,,,,
FYSGQLGKITSKSGPLIGMGK,ub,K,329,true,"Ubiquitylome analysis innate immunity",124,33793954,,,,,,,,
SGPLIGMGK,ph,S,334,true,"atm and atr DNA damage response",88,25561503,"MASCOT Score",30.0000000,1.0000000,,,,,-2.2900000
SGPLIGMGK,ph,S,334,true,"Tissue atlas Arabidopsis - ProteomicsDB",114,32188942,"MaxQuant score",121.6000000,1.0000000,,,,0.00026433699531481,
MGQTPERPSISSVKK,ph,T,350,true,"Phosphoproteome ethylene-regulated time response",46,24043427,"MASCOT Score",27.3000000,,,,,,-11.4771000
KMGQTPERPSISSVK,ph,T,350,true,"atm and atr DNA damage response",88,25561503,"MASCOT Score",20.0000000,1.0000000,,,,,-1.1000000
MGQTPERPSISSVK,ph,T,350,true,"atm and atr DNA damage response",88,25561503,"MASCOT Score",28.0000000,1.0000000,,,,,-0.1900000
MGQTPERPSISSVK,ph,T,350,true,"TOR Kinase and ABA Receptor",100,29290610,XCorr,2.7651224,0.9267000,,,,0.0017940000398085,
MGQTPERPSISSVK,ph,T,350,true,"Tissue atlas Arabidopsis - ProteomicsDB",114,32188942,"MaxQuant score",116.0000000,0.9999990,,,,2.7480000426294E-5,
GCMVSHDGITPLSTR,acy,C,377,true,"Arabidopsis S-acylation atlas - Meristem",163a,35681017,,,,,,,,
NSSAEHHILEDNSNSVHVENLTLPSRPK,ph,S,398,true,"Tissue atlas Arabidopsis - ProteomicsDB",114,32188942,"MaxQuant score",146.3500000,0.9051310,,,,0,
NSSAEHHILEDNSNSVHVENLTLPSRPK,ph,S,399,true,"Tissue atlas Arabidopsis - ProteomicsDB",114,32188942,"MaxQuant score",104.8100000,0.9961240,,,,2.2153500337509E-23,
NSSAEHHILEDNSNSVHVENLTLPSRPK,ph,S,411,true,"Tissue atlas Arabidopsis - ProteomicsDB",114,32188942,"MaxQuant score",189.2700000,0.8791980,,,,0,
ALQECTSSK,ph,T,586,true,"atm and atr DNA damage response",88,25561503,"MASCOT Score",43.0000000,0.8660000,,,,,-2.5500000
ALQECTSSK,ph,S,587,true,"atm and atr DNA damage response",88,25561503,"MASCOT Score",30.0000000,0.9590000,,,,,0.0700000
