Peptide,PTM,ModifiedAA,ModifiedPosition,PeptideUniqueToGene,ExperimentDesc,ExpID,PubmedID,ScoreType,IdentScore,LocProb,Log2FChange,PQ-val,QuantSig,PEP,MassErrorPPM
LVLQGNSSNGANVSR,ph,S,18,true,"Tissue atlas Arabidopsis - ProteomicsDB",114,32188942,"MaxQuant score",207.4000000,0.9379650,,,,2.8025969286496E-45,
LVLQGNSSNGANVSR,ph,S,19,true,"Tissue atlas Arabidopsis - ProteomicsDB",114,32188942,"MaxQuant score",191.8900000,0.9354700,,,,4.1365099784234E-34,
SKSFSFK,ph,S,29,true,"SnRK2 protein kinase substrates",85,23776212,XCorr,2.2229016,0.9810000,,,,0.020809300243855,
SKSFSFK,ph,S,29,true,"Tissue atlas Arabidopsis - ProteomicsDB",114,32188942,"MaxQuant score",179.7200000,0.9999960,,,,1.4289899809228E-5,
SFSFK,ph,S,29,false,"srk2dei ABA signaling phopshoproteomics",83,23572148,"MASCOT Score",22.0000000,,,,,,0.0002000
SKSFSFK,ph,S,31,true,"Tissue atlas Arabidopsis - ProteomicsDB",114,32188942,"MaxQuant score",126.5900000,0.9987720,,,,1.0271899895362E-17,
LAPDPASQTASPER,ph,S,333,true,"LAXIC - mannitol vs control",84b,23660473,XCorr,3.9400000,0.9840000,-1.2319747,,NO,2.5399998770936E-10,
LAPDPASQTASPER,ph,S,333,true,"atm and atr DNA damage response",88,25561503,"MASCOT Score",47.0000000,0.9450000,,,,,-0.5200000
LAPDPASQTASPER,ph,S,333,true,"Tissue atlas Arabidopsis - ProteomicsDB",114,32188942,"MaxQuant score",100.4000000,0.9606580,,,,0.00012997799785808,
LAPDPASQTASPER,ph,S,337,true,"STN8 phosphoproteome",38,21768351,"MASCOT Score",68.8900000,,,,,,-0.9951970
LAPDPASQTASPER,ph,S,337,true,"Large-scale phosphorylation discovery",44,23111157,XCorr,3.1890000,,,,,,
LAPDPASQTASPER,ph,S,337,true,"Chloroplast kinase substrates",60,19376835,"MASCOT Score",45.2500000,,,,,,-0.5217270
LAPDPASQTASPER,ph,S,337,true,"LAXIC - ABA stress",84a,23660473,XCorr,2.3100000,0.9690000,,,,0.14434799551964,
LAPDPASQTASPER,ph,S,337,true,"LAXIC - mannitol vs control",84b,23660473,XCorr,3.9400000,0.9970000,-1.1987367,,NO,2.5399998770936E-10,
LAPDPASQTASPER,ph,S,337,true,"SnRK2 protein kinase substrates",85,23776212,XCorr,3.0520699,0.9990000,,,,0.045985098928213,
LAPDPASQTASPER,ph,S,337,true,"atm and atr DNA damage response",88,25561503,"MASCOT Score",47.0000000,1.0000000,,,,,-0.5200000
LAPDPASQTASPER,ph,S,337,true,"Tissue atlas Arabidopsis - ProteomicsDB",114,32188942,"MaxQuant score",226.1400000,0.9996250,,,,0,
DDTHGSPWNLTHIGDSLATQNEGHSAPPTSSESSGSITR,ph,S,346,true,"Tissue atlas Arabidopsis - ProteomicsDB",114,32188942,"MaxQuant score",104.8800000,0.9283920,,,,7.6987000493289E-34,
LASIDSFDSR,ph,S,382,false,"Arabidopsis root NAA phosphoproteome",18a,27643528,"MaxQuant Score",66.0040000,1.0000000,,,,7.2310001996811E-5,0.8880000
LASIDSFDSR,ph,S,382,false,"Phosphorylation nuclei-enriched fractions",28,19245862,,,,,,,,
LASIDSFDSR,ph,S,382,false,"Phosphoproteomic analysis of seed maturation",42,22440515,"MASCOT Score",28.0000000,,,,,,-4.0000000
LASIDSFDSR,ph,S,382,false,"Pollen phosphoproteome Arabidopsis",43,22631563,"MASCOT Score",66.1400000,,,,,,-0.8009810
LASIDSFDSR,ph,S,382,false,"Phosphoproteome ethylene-regulated time response",46,24043427,"MASCOT Score",73.9600000,,,,,,8.4907000
LASIDSFDSR,ph,S,382,false,"PAMP-triggered phosphorylation",48,24601666,"MASCOT Score",30.3100000,,,,,,
LASIDSFDSR,ph,S,382,false,"Tyrosine phosphorylation in Arabidopsis",59,18463617,"MASCOT Score",54.0000000,,,,,,-0.1681377
LASIDSFDSR,ph,S,382,false,"srk2dei ABA signaling phopshoproteomics",83,23572148,"MASCOT Score",81.0000000,,,,,,0.0002000
LASIDSFDSR,ph,S,382,false,"LAXIC - ABA stress",84a,23660473,XCorr,3.6000000,1.0000000,,,,2.5699999241624E-5,
LASIDSFDSR,ph,S,382,false,"LAXIC - mannitol vs control",84b,23660473,XCorr,3.7100000,1.0000000,,,,5.7299998843519E-6,
LASIDSFDSR,ph,S,382,false,"SnRK2 protein kinase substrates",85,23776212,XCorr,3.4136732,1.0000000,,,,2.6085199351655E-5,
LASIDSFDSR,ph,S,382,false,"atm and atr DNA damage response",88,25561503,"MASCOT Score",51.0000000,1.0000000,,,,,0.0800000
LASIDSFDSR,ph,S,382,false,"Protein sumoylation and phosphorylation cross-talk",97,28419593,,,,,,,,
LASIDSFDSR,ph,S,382,false,"TOR Kinase and ABA Receptor",100,29290610,XCorr,3.6850612,1.0000000,,,,7.6750002335757E-5,
LASIDSFDSR,ph,S,382,false,"Lateral root-induction - NAA vs control",106,23328941,"MASCOT Score",40.0000000,,,,,,
LASIDSFDSR,ph,S,382,false,"Phospho cell culture sucrose/TOR",109,30833711,,,0.9999970,,,,,
LASIDSFDSR,ph,S,382,false,"Col-0 callus - FC Col-0 vs. Col-0 Xray",111a,31410901,,63.7000000,,0.1682595,0.0000000,NO,,0.2867090
LASIDSFDSR,ph,S,382,false,"Col-0 X-ray callus - FC Col-0 vs. Col-0 Xray",111b,31410901,,63.7000000,,0.1682595,0.0000000,NO,,0.2867090
LASIDSFDSR,ph,S,382,false,"atm callus - FC atm vs. atm Xray",111c,31410901,,63.7000000,,-0.0297127,0.0000000,NO,,0.2867090
LASIDSFDSR,ph,S,382,false,"atm-3 X-ray callus - FC atm vs. atm Xray",111d,31410901,,63.7000000,,-0.0297127,0.0000000,NO,,0.2867090
LASIDSFDSR,ph,S,382,false,"Tissue atlas Arabidopsis - ProteomicsDB",114,32188942,"MaxQuant score",164.4800000,1.0000000,,,,3.642190051778E-7,
LASIDSFDSR,ph,S,382,false,"Touch-induced phosphorylation: 40s touch vs untouc",136,30291188,"MASCOT score",68.2200000,,0.0975833,0.4142781,NO,,7.4125411
LASIDSFDSR,ph,S,385,false,"srk2dei ABA signaling phopshoproteomics",83,23572148,"MASCOT Score",44.0000000,,,,,,0.0004000
LASIDSFDSR,ph,S,385,false,"LAXIC - mannitol vs control",84b,23660473,XCorr,3.0600000,1.0000000,,,,8.8000000687316E-5,
LASIDSFDSR,ph,S,385,false,"atm and atr DNA damage response",88,25561503,"MASCOT Score",52.0000000,1.0000000,,,,,-0.3800000
LASIDSFDSR,ph,S,385,false,"Tissue atlas Arabidopsis - ProteomicsDB",114,32188942,"MaxQuant score",135.6000000,0.9983210,,,,1.6256899471045E-5,
LASIDSFDSR,ph,S,388,false,"Tissue atlas Arabidopsis - ProteomicsDB",114,32188942,"MaxQuant score",83.2040000,0.7844310,,,,0.0022640998940915,
