Peptide,PTM,ModifiedAA,ModifiedPosition,PeptideUniqueToGene,ExperimentDesc,ExpID,PubmedID,ScoreType,IdentScore,LocProb,Log2FChange,PQ-val,QuantSig,PEP,MassErrorPPM
MEEIRKEIDV,nta,M,1,true,"N-term acetylation drought responses",5,26184543,,,,,,,,
MEEIRKEI,nta,M,1,true,"Arabidopsis translation initiation landscape - NTA",167a,35069635,,,,,,,,
LKTESSSADNIQEDDGSSLR,ph,S,81,true,"Large-scale phosphorylation discovery",44,23111157,XCorr,3.2950000,,,,,,
LKTESSSADNIQEDDGSSLR,ph,S,81,true,"srk2dei ABA signaling phopshoproteomics",83,23572148,"MASCOT Score",42.0000000,,,,,,0.0000000
LKTESSSADNIQEDDGSSLR,ph,S,81,true,"Tissue atlas Arabidopsis - ProteomicsDB",114,32188942,"MaxQuant score",100.4300000,0.8087260,,,,4.7096300193061E-8,
TESSSADNIQEDDGSSLR,ph,S,81,true,"srk2dei ABA signaling phopshoproteomics",83,23572148,"MASCOT Score",58.0000000,,,,,,-0.0005000
TESSSADNIQEDDGSSLR,ph,S,81,true,"Lateral root-induction - NAA vs control",106,23328941,"MASCOT Score",44.0000000,,,,,,
LKTESSSADNIQEDDGSSLR,ph,S,82,true,"Large-scale phosphorylation discovery",44,23111157,XCorr,3.8950000,,,,,,
LKTESSSADNIQEDDGSSLR,ph,S,82,true,"srk2dei ABA signaling phopshoproteomics",83,23572148,"MASCOT Score",51.0000000,,,,,,0.0000000
LKTESSSADNIQEDDGSSLR,ph,S,82,true,"Col-0 callus - FC Col-0 vs. Col-0 Xray",111a,31410901,,86.6100000,,-0.3028143,0.0000000,NO,,1.4406372
LKTESSSADNIQEDDGSSLR,ph,S,82,true,"Col-0 X-ray callus - FC Col-0 vs. Col-0 Xray",111b,31410901,,86.6100000,,-0.3028143,0.0000000,NO,,1.4406372
LKTESSSADNIQEDDGSSLR,ph,S,82,true,"atm callus - FC atm vs. atm Xray",111c,31410901,,86.6100000,,0.6239707,0.0000000,NO,,1.4406372
LKTESSSADNIQEDDGSSLR,ph,S,82,true,"atm-3 X-ray callus - FC atm vs. atm Xray",111d,31410901,,86.6100000,,0.6239707,0.0000000,NO,,1.4406372
TESSSADNIQEDDGSSLR,ph,S,82,true,"srk2dei ABA signaling phopshoproteomics",83,23572148,"MASCOT Score",59.0000000,,,,,,0.0008000
TESSSADNIQEDDGSSLR,ph,S,82,true,"atm and atr DNA damage response",88,25561503,"MASCOT Score",38.0000000,0.9560000,,,,,0.2400000
TESSSADNIQEDDGSSLR,ph,S,82,true,"Lateral root-induction - NAA vs control",106,23328941,"MASCOT Score",78.0000000,,-0.1954136,0.3196882,NO,,
TESSSADNIQEDDGSSLR,ph,S,82,true,"Tissue atlas Arabidopsis - ProteomicsDB",114,32188942,"MaxQuant score",193.8000000,0.8122620,,,,2.8025969286496E-45,
LKTESSSADNIQEDDGSSLR,ph,S,83,true,"PAMP-triggered phosphorylation",48,24601666,"MASCOT Score",80.7700000,,,,,,
LKTESSSADNIQEDDGSSLR,ph,S,83,true,"Conserved plant phosphoproteome - Arabidopsis",61a,20466843,"MASCOT Score",54.0000000,1.0000000,,,,,
LKTESSSADNIQEDDGSSLR,ph,S,83,true,"srk2dei ABA signaling phopshoproteomics",83,23572148,"MASCOT Score",75.0000000,,,,,,-0.0014000
LKTESSSADNIQEDDGSSLR,ph,S,83,true,"LAXIC - ABA stress",84a,23660473,XCorr,3.2100000,0.9540000,,,,0.005715100094676,
LKTESSSADNIQEDDGSSLR,ph,S,83,true,"LAXIC - mannitol vs control",84b,23660473,XCorr,4.4900000,0.9940000,,,,0.0021129299420863,
LKTESSSADNIQEDDGSSLR,ph,S,83,true,"SnRK2 protein kinase substrates",85,23776212,XCorr,5.5862417,0.9970000,,,,6.9092502552603E-11,
LKTESSSADNIQEDDGSSLR,ph,S,83,true,"Protein sumoylation and phosphorylation cross-talk",97,28419593,,,,,,,,
LKTESSSADNIQEDDGSSLR,ph,S,83,true,"Touch-induced phosphorylation: 40s touch vs untouc",136,30291188,"MASCOT score",143.4700000,,-0.0581403,0.5423014,NO,,6.2397542
TESSSADNIQEDDGSSLR,ph,S,83,true,"Large-scale phosphorylation discovery",44,23111157,XCorr,4.5200000,,,,,,
TESSSADNIQEDDGSSLR,ph,S,83,true,"Tyrosine phosphorylation in Arabidopsis",59,18463617,"MASCOT Score",90.0000000,,,,,,-0.8543666
TESSSADNIQEDDGSSLR,ph,S,83,true,"Conserved plant phosphoproteome - Arabidopsis",61a,20466843,"MASCOT Score",90.0000000,1.0000000,,,,,
TESSSADNIQEDDGSSLR,ph,S,83,true,"srk2dei ABA signaling phopshoproteomics",83,23572148,"MASCOT Score",98.0000000,,,,,,-0.0012000
TESSSADNIQEDDGSSLR,ph,S,83,true,"LAXIC - ABA stress",84a,23660473,XCorr,5.5100000,0.9540000,,,,9.2099999848827E-10,
TESSSADNIQEDDGSSLR,ph,S,83,true,"LAXIC - mannitol vs control",84b,23660473,XCorr,5.1400000,0.9980000,-1.5779579,,NO,5.449999918028E-8,
TESSSADNIQEDDGSSLR,ph,S,83,true,"SnRK2 protein kinase substrates",85,23776212,XCorr,4.5978193,0.9690000,,,,3.7790399801452E-5,
TESSSADNIQEDDGSSLR,ph,S,83,true,"atm and atr DNA damage response",88,25561503,"MASCOT Score",102.0000000,0.9970000,,,,,-0.4700000
TESSSADNIQEDDGSSLR,ph,S,83,true,"TOR Kinase and ABA Receptor",100,29290610,XCorr,5.1547875,0.9229000,,,,1.8899999343347E-9,
TESSSADNIQEDDGSSLR,ph,S,83,true,"Lateral root-induction - NAA vs control",106,23328941,"MASCOT Score",66.0000000,,-0.1954577,0.3195895,NO,,
TESSSADNIQEDDGSSLR,ph,S,83,true,"Phospho cell culture sucrose/TOR",109,30833711,,,0.9970450,,,,,
TESSSADNIQEDDGSSLR,ph,S,83,true,"Tissue atlas Arabidopsis - ProteomicsDB",114,32188942,"MaxQuant score",380.1600000,0.9981520,,,,0,
IFKSPAAAAAAASVTAAYAIAK,ph,S,354,true,"Tissue atlas Arabidopsis - ProteomicsDB",114,32188942,"MaxQuant score",74.5160000,0.9998810,,,,8.6569599488939E-7,
SDKSDYPPPANPTLNGNGNSLPER,ph,S,392,true,"Tissue atlas Arabidopsis - ProteomicsDB",114,32188942,"MaxQuant score",44.1580000,0.9719040,,,,0.00090107001597062,
NRIDTIKEEK,ph,T,404,true,"Tissue atlas Arabidopsis - ProteomicsDB",114,32188942,"MaxQuant score",94.0900000,1.0000000,,,,0.00041908700950444,
IDTIKEEKR,ub,K,409,true,"Arabidopsis ubiquitination COFRADIC",40,26744219,"MaxQuant Score",77.6620000,0.9970000,,,,0.003000000026077,-0.3570000
ALESSIAETQVENAKLR,ub,K,425,true,"Arabidopsis ubiquitination COFRADIC",40,26744219,"MaxQuant Score",52.8620000,1.0000000,,,,5.2549999907114E-8,1.7640000
SASDEEEDGTVQR,nt,S,490,true,"Metacaspase9 substrates - in vitro rMC9",51c,23964026,"MASCOT Score",64.0000000,,1.7147971,,NO,,-0.3352031
QRSASDEEEDGTVQR,ph,S,490,true,"Large-scale phosphorylation discovery",44,23111157,XCorr,2.9680000,,,,,,
QRSASDEEEDGTVQR,ph,S,490,true,"atm and atr DNA damage response",88,25561503,"MASCOT Score",48.0000000,1.0000000,,,,,0.0200000
SASDEEEDGTVQR,ph,S,490,true,"STN8 phosphoproteome",38,21768351,"MASCOT Score",58.1100000,,,,,,
SASDEEEDGTVQR,ph,S,490,true,"LAXIC - ABA stress",84a,23660473,XCorr,4.9300000,0.9530000,,,,0.0034691200125962,
SASDEEEDGTVQR,ph,S,490,true,"LAXIC - mannitol vs control",84b,23660473,XCorr,4.9300000,0.9750000,,,,0.00092671299353242,
SASDEEEDGTVQR,ph,S,490,true,"atm and atr DNA damage response",88,25561503,"MASCOT Score",62.0000000,1.0000000,,,,,0.1500000
SASDEEEDGTVQR,ph,S,490,true,"Lateral root-induction - NAA vs control",106,23328941,"MASCOT Score",31.0000000,,,,,,
SASDEEEDGTVQR,ph,S,490,true,"Tissue atlas Arabidopsis - ProteomicsDB",114,32188942,"MaxQuant score",172.3000000,1.0000000,,,,2.7931298953284E-15,
QRSASDEEEDGTVQR,ph,S,492,true,"SnRK2 protein kinase substrates",85,23776212,XCorr,2.3284879,0.9370000,,,,5.7727898905569E-8,
QRSASDEEEDGTVQR,ph,S,492,true,"atm and atr DNA damage response",88,25561503,"MASCOT Score",48.0000000,1.0000000,,,,,0.0200000
QRSASDEEEDGTVQR,ph,S,492,true,"TOR Kinase and ABA Receptor",100,29290610,XCorr,4.9941049,0.9921000,,,,2.785000106087E-7,
SASDEEEDGTVQR,ph,S,492,true,"SnRK2 protein kinase substrates",85,23776212,XCorr,4.6323318,0.9760000,,,,0.00048727399553172,
SASDEEEDGTVQR,ph,S,492,true,"atm and atr DNA damage response",88,25561503,"MASCOT Score",78.0000000,1.0000000,,,,,-0.4900000
SASDEEEDGTVQR,ph,S,492,true,"Protein sumoylation and phosphorylation cross-talk",97,28419593,,,,,,,,
SASDEEEDGTVQR,ph,S,492,true,"TOR Kinase and ABA Receptor",100,29290610,XCorr,5.2904382,0.9336000,,,,9.2059998735294E-8,
SASDEEEDGTVQR,ph,S,492,true,"Lateral root-induction - NAA vs control",106,23328941,"MASCOT Score",66.0000000,,-0.0631205,0.6989503,NO,,
SASDEEEDGTVQR,ph,S,492,true,"Col-0 callus - FC Col-0 vs. Col-0 Xray",111a,31410901,,90.1300000,,-4.1714055,0.0000000,NO,,0.1508321
SASDEEEDGTVQR,ph,S,492,true,"Col-0 X-ray callus - FC Col-0 vs. Col-0 Xray",111b,31410901,,90.1300000,,-4.1714055,0.0000000,NO,,0.1508321
SASDEEEDGTVQR,ph,S,492,true,"atm callus - FC atm vs. atm Xray",111c,31410901,,90.1300000,,-5.1282775,0.0000000,NO,,0.1508321
SASDEEEDGTVQR,ph,S,492,true,"atm-3 X-ray callus - FC atm vs. atm Xray",111d,31410901,,90.1300000,,-5.1282775,0.0000000,NO,,0.1508321
SASDEEEDGTVQR,ph,S,492,true,"Tissue atlas Arabidopsis - ProteomicsDB",114,32188942,"MaxQuant score",333.1100000,1.0000000,,,,0,
SASDEEEDGTVQR,ph,T,499,true,"Tissue atlas Arabidopsis - ProteomicsDB",114,32188942,"MaxQuant score",207.6400000,1.0000000,,,,5.294240240249E-32,
QGSAGVWGLFGR,ph,S,505,true,"Pollen phosphoproteome Arabidopsis",43,22631563,"MASCOT Score",68.9600000,,,,,,
QGSAGVWGLFGR,ph,S,505,true,"LAXIC - mannitol vs control",84b,23660473,XCorr,2.0600000,1.0000000,,,,0.019233800470829,
QGSAGVWGLFGR,ph,S,505,true,"TOR Kinase and ABA Receptor",100,29290610,XCorr,3.4728496,1.0000000,,,,0.00025879999157041,
QGSAGVWGLFGR,ph,S,505,true,"Tissue atlas Arabidopsis - ProteomicsDB",114,32188942,"MaxQuant score",114.7900000,1.0000000,,,,4.7866698878352E-5,
