Peptide,PTM,ModifiedAA,ModifiedPosition,PeptideUniqueToGene,ExperimentDesc,ExpID,PubmedID,ScoreType,IdentScore,LocProb,Log2FChange,PQ-val,QuantSig,PEP,MassErrorPPM
SSSSASSPMSLEVSSPNSQFLDCLIYSR,nt,S,62,true,"HUNTER N-terminome: legumain, GluC and trypsin",119,31951383,"MaxQuant score",95.3190000,,,,,,
SSSSASSPMSLEVSSPN,nt,S,62,true,"HUNTER N-terminome: legumain, GluC and trypsin",119,31951383,"MaxQuant score",81.7090000,,,,,,
SSSSASSPMSLE,nt,S,62,true,"N-terminal ChaFRADIC",92,26010716,"MASCOT Score",20.0000000,,,,,0.00022760000138078,
SPMEICPLK,sno,C,246,true,"Site-specific nitrosomeproteomic id - gsnor1-3",90a,25699590,XCorr,2.2948976,,,,,0.068889997899532,-6.9463972
GGYLAFTSKDSAGVK,ac,K,364,true,"Histone deacetylases substrates - hda14 vs WT",98e,29061669,"MaxQuant Score",65.4000000,1.0000000,-0.2580000,0.9099133,NO,0.00014000000373926,
GSYASDPTGPCR,sno,C,456,true,"Site-specific nitrosomeproteomic id - gsnor1-3",90a,25699590,XCorr,2.7867978,,,,,0.0011149999918416,-4.6373301
NSDGFIENSTCVNNTASEHYMVDR,sno,C,518,true,"Site-specific nitrosomeproteomic id - gsnor1-3",90a,25699590,XCorr,3.5900000,,,,,0.052450001239777,-6.5100000
NSDGFIENSTCVNNTASEHYMVDR,sno,C,518,true,"Site-specific nitrosomeproteomic id - gsnor1-3",90b,25699590,XCorr,3.7700000,,,,,0.0034900000318885,-5.9300000
DYMLTNHEGK,mox,M,682,true,"cat2 Methionine oxidation - 1h stress",62a,25693801,"MASCOT Score",39.0000000,,0.1823245,,NO,,
