Peptide,PTM,ModifiedAA,ModifiedPosition,PeptideUniqueToGene,ExperimentDesc,ExpID,PubmedID,ScoreType,IdentScore,LocProb,Log2FChange,PQ-val,QuantSig,PEP,MassErrorPPM
YADDDIKDAIEMDALAPTSKDPPIWK,sumo,K,131,true,"SUMO Ligase SIZ1 heat stress",4,29588388,,,,,,,,
IDIQALTQKYGGGVTVQK,ph,T,292,true,"Phosphorylation in N starvation",63,22060019,"MASCOT Score",27.0000000,,,,,,-0.6261810
LFTEESNEK,ph,S,561,true,"atm and atr DNA damage response",88,25561503,"MASCOT Score",37.0000000,0.9410000,,,,,-3.2500000
LFTEESNEK,ph,S,561,true,"Tissue atlas Arabidopsis - ProteomicsDB",114,32188942,"MaxQuant score",136.5000000,1.0000000,,,,9.8532196716405E-5,
TGGFDGTAFEDFVSSPK,ph,S,578,true,"Tissue atlas Arabidopsis - ProteomicsDB",114,32188942,"MaxQuant score",239.5500000,0.8778080,,,,0,
TGGFDGTAFEDFVSSPK,ph,S,579,true,"TOR Kinase and ABA Receptor",100,29290610,XCorr,3.9581778,0.9851000,,,,2.2589999559841E-7,
TGGFDGTAFEDFVSSPK,ph,S,579,true,"Phospho cell culture sucrose/TOR",109,30833711,,,0.7814290,,,,,
TGGFDGTAFEDFVSSPK,ph,S,579,true,"Tissue atlas Arabidopsis - ProteomicsDB",114,32188942,"MaxQuant score",270.9500000,0.8933100,,,,0,
TGGFDGTAFEDFVSSPKSPLSPEK,ph,S,582,true,"Tissue atlas Arabidopsis - ProteomicsDB",114,32188942,"MaxQuant score",168.6900000,0.9882920,,,,0,
SPLSPEKEWQPR,ph,S,585,true,"atm and atr DNA damage response",88,25561503,"MASCOT Score",32.0000000,1.0000000,,,,,-0.7500000
SPLSPEKEWQPR,ph,S,585,true,"Phospho cell culture sucrose/TOR",109,30833711,,,0.9993120,,,,,
SPLSPEKEWQPR,ph,S,585,true,"Tissue atlas Arabidopsis - ProteomicsDB",114,32188942,"MaxQuant score",206.1900000,1.0000000,,,,1.9774800736482E-31,
KGGSDGESSWGNK,ph,S,860,true,"Tissue atlas Arabidopsis - ProteomicsDB",114,32188942,"MaxQuant score",58.8240000,0.9967580,,,,0.0068408898077905,
GGSAWSNQCGDFGSGK,ph,S,908,true,"Tissue atlas Arabidopsis - ProteomicsDB",114,32188942,"MaxQuant score",134.0800000,1.0000000,,,,6.0678601698783E-8,
GGRDQFGRGSSFGNSEDPAPWSK,me2,R,1105,true,"Arabidopsis protein methylome",123,31809900,"MaxQuant Score",61.3450000,1.0000000,,,,8.5735001675857E-7,-0.1387000
GGRDQFGRGSSFGNSEDPAPWSK,me2,R,1110,true,"Arabidopsis protein methylome",123,31809900,"MaxQuant Score",61.3450000,1.0000000,,,,8.5735001675857E-7,-0.1387000
TNAVAPSPSGSAAWGTGDKK,ph,S,1477,true,"Tissue atlas Arabidopsis - ProteomicsDB",114,32188942,"MaxQuant score",165.4000000,0.9859600,,,,4.9547000370775E-30,
