Peptide,PTM,ModifiedAA,ModifiedPosition,PeptideUniqueToGene,ExperimentDesc,ExpID,PubmedID,ScoreType,IdentScore,LocProb,Log2FChange,PQ-val,QuantSig,PEP,MassErrorPPM
DLSSPSALRPQVANLEDILSER,ph,S,85,true,"TOR Kinase and ABA Receptor",100,29290610,XCorr,3.0163503,0.9755000,,,,9.7099996310135E-7,
CGVGFIANLDNIPSHGVVKDALIALGCMEHR,nt,C,106,true,"Stromal N-terminome",96,26371235,"MASCOT Score",48.7600000,,,,,,
CGVGFIANLDNIPSHGVVKD,nt,C,106,true,"HUNTER N-terminome: legumain, GluC and trypsin",119,31951383,"MaxQuant score",85.8080000,,,,,,
CGVGFIANLD,nt,C,106,true,"HUNTER N-terminome: legumain, GluC and trypsin",119,31951383,"MaxQuant score",121.6200000,,,,,,
CGVGFIANLDNIPSHGVVK,ox,C,106,true,"SPEAR - 50 mM H2O2 / mock",138b,34619326,,,,2.1071635,0.0445862,YES,,
DALIALGCMEHR,ox,C,132,false,"SPEAR - 50 mM H2O2 / mock",138b,34619326,,,,1.9886573,0.0225888,YES,,
EQSLAPFDK,ph,S,168,true,"atm and atr DNA damage response",88,25561503,"MASCOT Score",33.0000000,1.0000000,,,,,-0.7600000
EVPVNVPIVGKNAR,ac,K,224,true,"Quantitative Acetylproteomics",101,29440448,,,,,,,,
NARETMPNIQQVFVK,mox,M,230,true,"cat2 Methionine oxidation - 1h stress",62a,25693801,"MASCOT Score",61.0000000,,0.0009234,,NO,,
IAKEDSTDDIER,cr,K,242,true,"Open search Plant PTM Viewer 2.0 - Crotonylation",164c,TBA,,,,,,,,
YSTNTSPR,ph,S,322,true,"Tissue atlas Arabidopsis - ProteomicsDB",114,32188942,"MaxQuant score",163.6500000,0.9011380,,,,0.00012042700109305,
TVGACLDR,ox,C,453,false,"OxiTRAQ Arabidopsis - 5 mM H2O2 versus control",47,24376095,,,,1.3124007,0.0012565,YES,,
TVGACLDR,sno,C,453,false,"hot5-4 / wildtype, FAT-switch S-nitrosoproteome",169,37277371,,,,,,,,
FLKPVNFK,ac,K,537,true,"Histone deacetylases substrates - TSA vs control",98b,29061669,"MaxQuant Score",122.1000000,1.0000000,-0.9070000,0.6338697,NO,0.0007999999797903,
FLKPVNFKSSTVMENEEILR,ac,K,542,true,"Quantitative Acetylproteomics",101,29440448,,,,,,,,
SSTVMENEEILR,ph,S,543,true,"atm and atr DNA damage response",88,25561503,"MASCOT Score",44.0000000,0.9980000,,,,,0.1200000
DQYLKPK,ac,K,670,true,"Quantitative Acetylproteomics",101,29440448,,,,,,,,
KGVEGSLQK,ph,S,687,true,"atm and atr DNA damage response",88,25561503,"MASCOT Score",34.0000000,1.0000000,,,,,-4.2300000
ALYYLCEAADDAVR,ph,Y,693,true,"Tissue atlas Arabidopsis - ProteomicsDB",114,32188942,"MaxQuant score",84.5070000,0.9000690,,,,0.0013625300489366,
ALYYLCEAADDAVR,acy,C,696,true,"Arabidopsis S-acylation atlas - Silique",163e,35681017,,,,,,,,
ALYYLCEAADDAVR,sno,C,696,true,"hot5-4 / wildtype, FAT-switch S-nitrosoproteome",169,37277371,,,,0.2212122,0.5632841,NO,,
SGSQLLVLSDR,nt,S,705,true,"N-terminal ChaFRADIC",92,26010716,"MASCOT Score",45.2000000,,,,,0.00047920001088642,
SGSQLLVLSDR,nt,S,705,true,"Stromal N-terminome",96,26371235,"MASCOT Score",106.3500000,,,,,,
IPTVTIEQAQKNYTK,ac,K,811,true,"Histone deacetylases- hda14 vs WT (low light)",98c,29061669,"MaxQuant Score",158.2900000,1.0000000,-0.2450000,0.9885531,NO,1.9000000184288E-10,
NYTKAVNAGLLK,ac,K,815,true,"Histone deacetylases - apicidin vs control",98a,29061669,"MaxQuant Score",91.2000000,1.0000000,-0.0080000,0.9727472,NO,1.599999990276E-7,
NYTKAVNAGLLK,ac,K,815,true,"Histone deacetylases substrates - hda14 vs WT",98e,29061669,"MaxQuant Score",68.7000000,1.0000000,0.2270000,0.6982324,NO,0.00025000001187436,
ISGLTFDELAR,ph,S,864,true,"atm and atr DNA damage response",88,25561503,"MASCOT Score",49.0000000,1.0000000,,,,,0.8700000
AFSEDTTKR,ac,K,889,true,"Histone deacetylases - apicidin vs control",98a,29061669,"MaxQuant Score",123.1000000,1.0000000,-0.2720000,0.1866380,NO,0.0089999996125698,
AFSEDTTKR,ac,K,889,true,"Histone deacetylases- hda14 vs WT (low light)",98c,29061669,"MaxQuant Score",131.4500000,1.0000000,0.9910000,0.9885531,NO,0.00049000000581145,
AFSEDTTKR,ac,K,889,true,"Quantitative Acetylproteomics",101,29440448,,,,,,,,
DLLEFKSDRAPIPVGK,ac,K,950,true,"Quantitative Acetylproteomics",101,29440448,,,,,,,,
DLLEFKSDR,ac,K,950,false,"Histone deacetylases substrates - TSA vs control",98b,29061669,"MaxQuant Score",82.4000000,1.0000000,-0.0180000,0.9977001,NO,0.003000000026077,
DLLEFKSDR,ac,K,950,false,"Histone deacetylases substrates - hda14 vs WT",98e,29061669,"MaxQuant Score",64.8000000,1.0000000,-0.0570000,0.9204496,NO,0.0060000000521541,
DLLEFKSDR,ac,K,950,false,"Quantitative Acetylproteomics",101,29440448,,,,,,,,
APIPVGKVEPAVAIVQR,ac,K,960,true,"Histone deacetylases - apicidin vs control",98a,29061669,"MaxQuant Score",158.9000000,1.0000000,-0.2070000,0.2594179,NO,1.0000000467011E-34,
APIPVGKVEPAVAIVQR,ac,K,960,true,"Histone deacetylases- hda14 vs WT (low light)",98c,29061669,"MaxQuant Score",59.7300000,1.0000000,0.1170000,0.9885531,NO,0.0070000002160668,
APIPVGKVEPAVAIVQR,ac,K,960,true,"Histone deacetylases substrates - hda14 vs WT",98e,29061669,"MaxQuant Score",61.2000000,1.0000000,0.1380000,0.9099133,NO,0.0020000000949949,
FCTGGMSLGAISR,so,C,972,false,"S-sulfenylation site detection using YAP1C",110,32714340,,,,,,,,
IGGKSNSGEGGEDPIR,ac,K,999,true,"Quantitative Acetylproteomics",101,29440448,,,,,,,,
VAQGAKPGEGGQLPGKK,ac,K,1082,false,"Quantitative Acetylproteomics",101,29440448,,,,,,,,
VAGVIAKK,ac,K,1390,true,"Quantitative Acetylproteomics",101,29440448,,,,,,,,
GMAGGEIVVTPVEK,mox,M,1437,true,"cat2 Methionine oxidation - 1h stress",62a,25693801,"MASCOT Score",66.0000000,,-0.1446515,,NO,,
GMAGGEIVVTPVEK,mox,M,1437,true,"cat2 Methionine oxidation - 3h stress",62b,25693801,"MASCOT Score",60.0000000,,0.2430767,,NO,,
GMAGGEIVVTPVEK,ph,T,1445,true,"SIRK1 phosphorylation",86a,23820729,"MaxQuant Score",82.2570000,1.0000000,,,,0.85600000619888,3.8770000
IGFVPEEATIVGNTC,sno,C,1464,true,"Cold stress nitrosylation - 4°C vs 22°C",65,24388526,,,,,,,,
VTAPAGELQLKSLIEAHVEK,cr,K,1562,true,"Open search Plant PTM Viewer 2.0 - Crotonylation",164c,TBA,,,,,,,,
TSTGEVTFQSA,ph,T,1614,true,"atm and atr DNA damage response",88,25561503,"MASCOT Score",35.0000000,0.9430000,,,,,-0.2200000
TSTGEVTFQSA,ph,S,1621,true,"atm and atr DNA damage response",88,25561503,"MASCOT Score",37.0000000,1.0000000,,,,,-0.4000000
