Peptide,PTM,ModifiedAA,ModifiedPosition,PeptideUniqueToGene,ExperimentDesc,ExpID,PubmedID,ScoreType,IdentScore,LocProb,Log2FChange,PQ-val,QuantSig,PEP,MassErrorPPM
AATATSSSHHGLASTTR,ph,S,590,true,"Tissue atlas Arabidopsis - ProteomicsDB",114,32188942,"MaxQuant score",152.0600000,0.8317810,,,,2.0001399625089E-13,
RIPSWNVLAR,ph,S,608,true,"atm and atr DNA damage response",88,25561503,"MASCOT Score",43.0000000,1.0000000,,,,,-0.3700000
RIPSWNVLAR,ph,S,608,true,"Tissue atlas Arabidopsis - ProteomicsDB",114,32188942,"MaxQuant score",131.0600000,1.0000000,,,,2.0361900169519E-5,
IPSWNVLAR,ph,S,608,true,"atm and atr DNA damage response",88,25561503,"MASCOT Score",25.0000000,1.0000000,,,,,-0.6300000
ENSTGSLDDLVTDNNLHASSGR,ph,S,617,true,"atm and atr DNA damage response",88,25561503,"MASCOT Score",88.0000000,1.0000000,,,,,-0.4400000
ENSTGSLDDLVTDNNLHASSGR,ph,S,617,true,"Col-0 callus - FC Col-0 vs. Col-0 Xray",111a,31410901,,49.1000000,,0.1393327,0.0000000,NO,,0.9158062
ENSTGSLDDLVTDNNLHASSGR,ph,S,617,true,"Col-0 X-ray callus - FC Col-0 vs. Col-0 Xray",111b,31410901,,49.1000000,,0.1393327,0.0000000,NO,,0.9158062
ENSTGSLDDLVTDNNLHASSGR,ph,S,617,true,"atm callus - FC atm vs. atm Xray",111c,31410901,,49.1000000,,-0.2442377,0.0000000,NO,,0.9158062
ENSTGSLDDLVTDNNLHASSGR,ph,S,617,true,"atm-3 X-ray callus - FC atm vs. atm Xray",111d,31410901,,49.1000000,,-0.2442377,0.0000000,NO,,0.9158062
ENSTGSLDDLVTDNNLHASSGR,ph,S,617,true,"Tissue atlas Arabidopsis - ProteomicsDB",114,32188942,"MaxQuant score",264.0900000,0.9925210,,,,0,
ENSTGSLDDLVTDNNLHASSGR,ph,S,620,true,"Tissue atlas Arabidopsis - ProteomicsDB",114,32188942,"MaxQuant score",121.0200000,0.9976100,,,,1.8580700009734E-21,
GFSSSPNSPAVPPGGSFTPSPR,ph,T,700,true,"Tissue atlas Arabidopsis - ProteomicsDB",114,32188942,"MaxQuant score",143.4600000,0.7639900,,,,3.501989864426E-32,
GFSSSPNSPAVPPGGSFTPSPR,ph,S,702,true,"Tissue atlas Arabidopsis - ProteomicsDB",114,32188942,"MaxQuant score",137.8700000,0.9343030,,,,1.9582299562258E-28,
