Peptide,PTM,ModifiedAA,ModifiedPosition,PeptideUniqueToGene,ExperimentDesc,ExpID,PubmedID,ScoreType,IdentScore,LocProb,Log2FChange,PQ-val,QuantSig,PEP,MassErrorPPM
SNPMFPEKWEESSTSK,ph,S,13,true,"Tissue atlas Arabidopsis - ProteomicsDB",114,32188942,"MaxQuant score",202.8400000,0.8150620,,,,0,
TYSKSSDENEELDQERPR,ph,S,84,true,"Tissue atlas Arabidopsis - ProteomicsDB",114,32188942,"MaxQuant score",136.3400000,0.9990880,,,,6.8819000215018E-15,
TYSKSSDENEELDQERPR,ph,S,85,true,"Tissue atlas Arabidopsis - ProteomicsDB",114,32188942,"MaxQuant score",136.3400000,0.9999940,,,,6.8819000215018E-15,
QSTRTLYGAGQR,ph,S,121,true,"TOR Kinase and ABA Receptor",100,29290610,XCorr,2.5908339,0.8994000,,,,0.00013479999324773,
QSTRTLYGAGQR,ph,T,122,true,"Tissue atlas Arabidopsis - ProteomicsDB",114,32188942,"MaxQuant score",63.7090000,0.7514330,,,,0.0040766401216388,
VVTDQESK,ph,T,288,true,"atm and atr DNA damage response",88,25561503,"MASCOT Score",37.0000000,1.0000000,,,,,-0.9400000
EGSSGELREEDGKK,ph,S,405,true,"Tissue atlas Arabidopsis - ProteomicsDB",114,32188942,"MaxQuant score",162.1000000,1.0000000,,,,4.9638299026711E-10,
EGSSGELREEDGK,ph,S,405,true,"atm and atr DNA damage response",88,25561503,"MASCOT Score",37.0000000,1.0000000,,,,,-0.5000000
EGSSGELREEDGKK,ph,S,406,true,"Tissue atlas Arabidopsis - ProteomicsDB",114,32188942,"MaxQuant score",98.9740000,1.0000000,,,,0.00017717700393405,
EGSSGELREEDGK,ph,S,406,true,"atm and atr DNA damage response",88,25561503,"MASCOT Score",37.0000000,1.0000000,,,,,-0.5000000
GHDDLVSPAREENETVNSQTQTILR,ph,S,605,true,"Phosphorylation Early Elicitor Signaling",23,17317660,,,,,,,,
GHDDLVSPAREENETVNSQTQTILR,ph,S,605,true,"SnRK2 protein kinase substrates",85,23776212,XCorr,2.9266691,0.9980000,,,,0.0027692799922079,
GHDDLVSPAREENETVNSQTQTILR,ph,S,605,true,"TOR Kinase and ABA Receptor",100,29290610,XCorr,6.1245480,1.0000000,,,,1.9069999552812E-6,
GHDDLVSPAREENETVNSQTQTILR,ph,S,605,true,"Tissue atlas Arabidopsis - ProteomicsDB",114,32188942,"MaxQuant score",291.4700000,1.0000000,,,,0,
DNKDATDILEVSPAK,ph,S,635,true,"Tissue atlas Arabidopsis - ProteomicsDB",114,32188942,"MaxQuant score",192.1800000,1.0000000,,,,1.0133000171883E-24,
DATDILEVSPAK,ph,S,635,true,"Tyrosine phosphorylation in Arabidopsis",59,18463617,"MASCOT Score",62.0000000,,,,,,-1.7194857
SDEENETVNSPTIWR,ph,S,659,true,"srk2dei ABA signaling phopshoproteomics",83,23572148,"MASCOT Score",50.0000000,,,,,,0.0005000
SDEENETVNSPTIWR,ph,S,668,true,"Tyrosine phosphorylation in Arabidopsis",59,18463617,"MASCOT Score",23.0000000,,,,,,-1.2932705
TEGEEMMLDYALRQAISR,ph,S,917,true,"srk2dei ABA signaling phopshoproteomics",83,23572148,"MASCOT Score",27.0000000,,,,,,0.0028000
GEEEVHNTPKESR,ph,T,1002,true,"srk2dei ABA signaling phopshoproteomics",83,23572148,"MASCOT Score",27.0000000,,,,,,-0.0016000
DLKGEEEVHNTPK,ph,T,1002,true,"Tissue atlas Arabidopsis - ProteomicsDB",114,32188942,"MaxQuant score",125.2500000,1.0000000,,,,2.9820799682057E-5,
FVSDLGSLTR,ph,S,1155,true,"Tissue atlas Arabidopsis - ProteomicsDB",114,32188942,"MaxQuant score",124.6000000,1.0000000,,,,9.6318297437392E-5,
FVSDLGSLTRLSPK,ph,T,1161,true,"Tissue atlas Arabidopsis - ProteomicsDB",114,32188942,"MaxQuant score",77.9690000,0.8940550,,,,0.00026362598873675,
RFVSDLGSLTRLSPK,ph,S,1164,true,"Arabidopsis root NAA phosphoproteome",18a,27643528,"MaxQuant Score",51.2250000,0.9160000,,,,0.00021779999951832,0.2080000
FVSDLGSLTRLSPK,ph,S,1164,true,"Phosphorylation Early Elicitor Signaling",23,17317660,,,,,,,,
FVSDLGSLTRLSPK,ph,S,1164,true,"STN8 phosphoproteome",38,21768351,"MASCOT Score",79.9300000,,,,,,-1.8386700
FVSDLGSLTRLSPK,ph,S,1164,true,"Tissue atlas Arabidopsis - ProteomicsDB",114,32188942,"MaxQuant score",291.6800000,0.9999990,,,,0,
FVSDLGSLTRLSPKTPR,ph,T,1167,true,"Tissue atlas Arabidopsis - ProteomicsDB",114,32188942,"MaxQuant score",85.9320000,0.9939090,,,,0.00071174802724272,
QSSISSMAAHYENEANAEIIR,ph,S,1254,true,"Phospho cell culture sucrose/TOR",109,30833711,,,0.9352990,,,,,
QSSISSMAAHYENEANAEIIR,ph,S,1254,true,"Tissue atlas Arabidopsis - ProteomicsDB",114,32188942,"MaxQuant score",168.5500000,0.9985600,,,,1.5617200093517E-36,
