Peptide,PTM,ModifiedAA,ModifiedPosition,PeptideUniqueToGene,ExperimentDesc,ExpID,PubmedID,ScoreType,IdentScore,LocProb,Log2FChange,PQ-val,QuantSig,PEP,MassErrorPPM
SNHNSGNTGKAKAER,nt,S,42,true,"Arabidopsis translation initiation landscape - NT",167b,35069635,,,,,,,,
VGNNMYASSLGLQR,ph,S,87,true,"Tissue atlas Arabidopsis - ProteomicsDB",114,32188942,"MaxQuant score",133.4800000,0.8262020,,,,2.773999949568E-5,
VGNNMYASSLGLQR,ph,S,88,true,"Tissue atlas Arabidopsis - ProteomicsDB",114,32188942,"MaxQuant score",139.8600000,0.9574130,,,,2.4840198875609E-6,
IQMAADSAGGSSSGK,ph,S,151,true,"Tissue atlas Arabidopsis - ProteomicsDB",114,32188942,"MaxQuant score",66.8090000,0.8662780,,,,0.00025218099472113,
IQMAADSAGGSSSGK,ph,S,155,true,"atm and atr DNA damage response",88,25561503,"MASCOT Score",72.0000000,0.9940000,,,,,-0.6300000
IQMAADSAGGSSSGK,ph,S,155,true,"TOR Kinase and ABA Receptor",100,29290610,XCorr,4.1957831,0.8182000,,,,1.0990000191669E-5,
IQMAADSAGGSSSGK,ph,S,155,true,"Lateral root-induction - NAA vs control",106,23328941,"MASCOT Score",38.0000000,,,,,,
IQMAADSAGGSSSGK,ph,S,155,true,"Tissue atlas Arabidopsis - ProteomicsDB",114,32188942,"MaxQuant score",258.1400000,0.8937300,,,,0,
IQMAADSAGGSSSGK,ph,S,156,true,"atm and atr DNA damage response",88,25561503,"MASCOT Score",53.0000000,0.9530000,,,,,-0.3400000
IQMAADSAGGSSSGK,ph,S,156,true,"Tissue atlas Arabidopsis - ProteomicsDB",114,32188942,"MaxQuant score",250.9400000,0.8046570,,,,0,
TSPSSAETVSHR,ph,T,203,true,"Tissue atlas Arabidopsis - ProteomicsDB",114,32188942,"MaxQuant score",84.1700000,0.8461060,,,,0.00092138699255884,
TSPSSAETVSHR,ph,S,204,true,"atm and atr DNA damage response",88,25561503,"MASCOT Score",45.0000000,0.9490000,,,,,-0.3000000
HRALLFK,me2,R,359,false,"Arabidopsis protein methylome",123,31809900,"MaxQuant Score",53.5540000,1.0000000,,,,0.0091028697788715,-2.2238000
VCDFGLSR,ox,C,693,false,"SPEAR - 10 mM H2O2 / mock",138a,34619326,,,,0.7973134,0.0395585,YES,,
LKASTFLSSK,ph,T,704,true,"Tissue atlas Arabidopsis - ProteomicsDB",114,32188942,"MaxQuant score",85.5220000,0.7595920,,,,0.0099634500220418,
ASTFLSSK,ph,T,704,true,"atm and atr DNA damage response",88,25561503,"MASCOT Score",37.0000000,0.9310000,,,,,-1.2300000
ASTFLSSK,ph,S,707,true,"atm and atr DNA damage response",88,25561503,"MASCOT Score",41.0000000,0.9020000,,,,,-0.6300000
ASTFLSSK,ph,S,707,true,"TOR Kinase and ABA Receptor",100,29290610,XCorr,2.4975717,0.9017000,,,,0.0022390000522137,
ASTFLSSK,ph,S,707,true,"Tissue atlas Arabidopsis - ProteomicsDB",114,32188942,"MaxQuant score",108.4000000,0.9679480,,,,0.0038483599200845,
SAAGTPEWMAPEVLRDEPSNEK,ph,S,710,true,"Phospho cell culture sucrose/TOR",109,30833711,,,0.9897250,,,,,
SAAGTPEWMAPEVLR,ph,S,710,true,"Large-scale phosphorylation discovery",44,23111157,XCorr,4.3060000,,,,,,
SAAGTPEWMAPEVLR,ph,S,710,true,"atm and atr DNA damage response",88,25561503,"MASCOT Score",36.0000000,0.9970000,,,,,-1.0100000
SAAGTPEWMAPEVLR,ph,S,710,true,"Tissue atlas Arabidopsis - ProteomicsDB",114,32188942,"MaxQuant score",236.4000000,0.9999970,,,,0,
