Peptide,PTM,ModifiedAA,ModifiedPosition,PeptideUniqueToGene,ExperimentDesc,ExpID,PubmedID,ScoreType,IdentScore,LocProb,Log2FChange,PQ-val,QuantSig,PEP,MassErrorPPM
MQPTETSQPAPSDQGRRLKDQLSESMSF,nta,M,1,true,"Arabidopsis translation initiation landscape - NTA",167a,35069635,,,,,,,,
MQPTETSQPAPSDQGR,nta,M,1,true,"Characterization plant N-terminal acetylation",6,22223895,"MASCOT Score",74.1900000,,,,,,
MQPTETSQPAPSDQGR,nta,M,1,true,"Arg/N-end rule pathway Roots",80,25728785,"MASCOT Score",74.1100000,,,,,7.5460002335603E-7,
MQPTETSQPAPSDQGR,nta,M,1,true,"Arg/N-end rule seed, prt6 vs. Wt",99,29168982,"MASCOT Score",81.5700000,,,,,0.00071920000482351,-1.7096229
MQPTETSQPA,nta,M,1,true,"N-term acetylation drought responses",5,26184543,,,,,,,,
MQPTETSQPAPSDQGR,ph,T,4,true,"Lateral root-induction - NAA vs control",106,23328941,"MASCOT Score",31.0000000,,-0.0590561,0.7128378,NO,,
LKDQLSESMSFSSQMK,ph,S,23,true,"Large-scale phosphorylation discovery",44,23111157,XCorr,4.0250000,,,,,,
LKDQLSESMSFSSQMK,ph,S,23,true,"Tissue atlas Arabidopsis - ProteomicsDB",114,32188942,"MaxQuant score",51.0130000,0.8188780,,,,0.0032540499232709,
DQLSESMSFSSQMK,ph,S,23,true,"srk2dei ABA signaling phopshoproteomics",83,23572148,"MASCOT Score",25.0000000,,,,,,-0.0012000
LKDQLSESMSFSSQMK,ph,S,25,true,"Large-scale phosphorylation discovery",44,23111157,XCorr,3.9590000,,,,,,
LKDQLSESMSFSSQMK,ph,S,25,true,"Tissue atlas Arabidopsis - ProteomicsDB",114,32188942,"MaxQuant score",114.4000000,0.9744150,,,,3.6529200997393E-7,
DQLSESMSFSSQMK,ph,S,25,true,"srk2dei ABA signaling phopshoproteomics",83,23572148,"MASCOT Score",48.0000000,,,,,,0.0002000
LKDQLSESMSFSSQMKK,ph,S,27,true,"Chloroplast kinase substrates",60,19376835,"MASCOT Score",36.8100000,,,,,,-0.3265970
LKDQLSESMSFSSQMK,ph,S,27,true,"Phosphoproteome iron-deficient Arabidopsis roots",41,22438062,"MASCOT Score",67.0500000,,,,,,
LKDQLSESMSFSSQMK,ph,S,27,true,"Large-scale phosphorylation discovery",44,23111157,XCorr,4.2520000,,,,,,
LKDQLSESMSFSSQMK,ph,S,27,true,"atm and atr DNA damage response",88,25561503,"MASCOT Score",54.0000000,0.9460000,,,,,-0.2000000
DQLSESMSFSSQMK,ph,S,27,true,"Arabidopsis root NAA phosphoproteome",18a,27643528,"MaxQuant Score",79.3930000,0.8510000,,,,1.391999973066E-7,-1.2220000
DQLSESMSFSSQMK,ph,S,27,true,"Large-scale phosphorylation discovery",44,23111157,XCorr,5.4730000,,,,,,
DQLSESMSFSSQMK,ph,S,27,true,"Chloroplast kinase substrates",60,19376835,"MASCOT Score",40.4000000,,,,,,-0.8141220
DQLSESMSFSSQMK,ph,S,27,true,"srk2dei ABA signaling phopshoproteomics",83,23572148,"MASCOT Score",95.0000000,,,,,,0.0001000
DQLSESMSFSSQMK,ph,S,27,true,"atm and atr DNA damage response",88,25561503,"MASCOT Score",70.0000000,1.0000000,,,,,-0.3300000
DQLSESMSFSSQMK,ph,S,27,true,"Phospho cell culture sucrose/TOR",109,30833711,,,0.9939670,,,,,
DQLSESMSFSSQMK,ph,S,27,true,"Tissue atlas Arabidopsis - ProteomicsDB",114,32188942,"MaxQuant score",310.9000000,0.9999750,,,,0,
LKDQLSESMSFSSQMK,ph,S,29,true,"Large-scale phosphorylation discovery",44,23111157,XCorr,2.8030000,,,,,,
DQLSESMSFSSQMK,ph,S,29,true,"srk2dei ABA signaling phopshoproteomics",83,23572148,"MASCOT Score",40.0000000,,,,,,0.0029000
DQLSESMSFSSQMK,ph,S,30,true,"Large-scale phosphorylation discovery",44,23111157,XCorr,4.4070000,,,,,,
DQLSESMSFSSQMK,ph,S,30,true,"srk2dei ABA signaling phopshoproteomics",83,23572148,"MASCOT Score",46.0000000,,,,,,-0.0001000
KEDDELSMK,ph,S,40,true,"atm and atr DNA damage response",88,25561503,"MASCOT Score",36.0000000,1.0000000,,,,,1.5100000
KEDDELSMK,ph,S,40,true,"Phospho cell culture sucrose/TOR",109,30833711,,,1.0000000,,,,,
AKEEEIEKK,ac,K,56,false,"Quantitative Acetylproteomics",101,29440448,,,,,,,,
KEVTMVR,ub,K,95,true,"Arabidopsis ubiquitination COFRADIC",40,26744219,"MaxQuant Score",122.7400000,1.0000000,,,,0.0049999998882413,-0.6570000
EVTMVRK,mox,M,99,true,"cat2 Methionine oxidation - 1h stress",62a,25693801,"MASCOT Score",49.0000000,,0.1295555,,NO,,
ETEYKDALEAFNEK,ub,K,126,true,"upl3 mutant / wildtype",168,35926874,"MaxQuant score",122.6400000,1.0000000,1.3213509,0.0871570,NO,1.1677400379995E-6,1.3509000
VELITKLQELEGESEK,ub,K,145,true,"upl3 mutant / wildtype",168,35926874,"MaxQuant score",75.9110000,1.0000000,0.5109619,,,3.9384900446748E-5,0.1178100
LQELEGESEKFR,ac,K,155,true,"Quantitative Acetylproteomics",101,29440448,,,,,,,,
