Peptide,PTM,ModifiedAA,ModifiedPosition,PeptideUniqueToGene,ExperimentDesc,ExpID,PubmedID,ScoreType,IdentScore,LocProb,Log2FChange,PQ-val,QuantSig,PEP,MassErrorPPM
AGKQSAEFDSSSQAISASEKVLVPDNLDDDPR,nt,A,46,true,"HUNTER N-terminome: legumain, GluC and trypsin",119,31951383,"MaxQuant score",172.1100000,,,,,,
AGKQSAEFDSSSQAISASEKVLVPDN,nt,A,46,true,"HUNTER N-terminome: legumain, GluC and trypsin",119,31951383,"MaxQuant score",50.8270000,,,,,,
GKQSAEFDSSSQAISASEKVLVPDNLDDDPR,nt,G,47,true,"HUNTER N-terminome: legumain, GluC and trypsin",119,31951383,"MaxQuant score",79.2860000,,,,,,
SAEFDSSSQAISASEKVLVPDNLDDDPR,nt,S,50,true,"HUNTER N-terminome: legumain, GluC and trypsin",119,31951383,"MaxQuant score",63.6250000,,,,,,
SAEFDSSSQAISASEKVLVPDN,nt,S,50,true,"HUNTER N-terminome: legumain, GluC and trypsin",119,31951383,"MaxQuant score",79.5680000,,,,,,
FDSSSQAISASE,nt,F,53,true,"Arg/N-end rule seed, prt6 vs. Wt",99,29168982,"MASCOT Score",52.1800000,,-1.3310087,0.0538860,NO,9.2130001576152E-5,-2.3838769
KIYEIDPMLRTYNNHLDYR,ub,K,124,true,"Protein ubiquitination during photomorphogenesis",3,28461270,,,,,,,,
IRMDTPSGIK,mox,M,239,false,"cat2 Methionine oxidation - 1h stress",62a,25693801,"MASCOT Score",45.0000000,,-0.2055118,,NO,,
YVFKHPQPK,ac,K,281,true,"Quantitative Acetylproteomics",101,29440448,,,,,,,,
CISYAESHDQALVGDK,sno,C,566,true,"Site-specific nitrosomeproteomic id - gsnor1-3",90a,25699590,XCorr,4.4783559,,,,,7.4289999929533E-8,-6.0228312
CISYAESHDQALVGDK,sno,C,566,true,"Site-specific nitrosomeproteomic id - gsnor1-3",90b,25699590,XCorr,4.1600000,,,,,9.1659996542148E-5,-7.7000000
LSDGSVIPGNNFSYDKCR,so,C,667,true,"Arabidopsis S-sulfenylation chemoproteomics",108,31578252,"pFind PSM Score",0.0627007,,1.3157900,,,,-1.5447374
