Peptide,PTM,ModifiedAA,ModifiedPosition,PeptideUniqueToGene,ExperimentDesc,ExpID,PubmedID,ScoreType,IdentScore,LocProb,Log2FChange,PQ-val,QuantSig,PEP,MassErrorPPM
AEEKSFKYVI,nt,A,2,true,"N-term acetylation drought responses",5,26184543,,,,,,,,
AEEKSFKYVIVGGGVAAGYAAR,nta,A,2,true,"HUNTER N-terminome: legumain, GluC and trypsin",119,31951383,"MaxQuant score",47.3200000,,,,,,
AEEKSFKYVIVGGGVAAGY,nta,A,2,true,"Arg/N-end rule pathway Roots",80,25728785,"MASCOT Score",42.4400000,,,,,0.012190000154078,
AEEKSFKYVI,nta,A,2,true,"N-term acetylation drought responses",5,26184543,,,,,,,,
AEEKSFK,ac,K,5,true,"Quantitative Acetylproteomics",101,29440448,,,,,,,,
ADLAAKTLVSGTGQVFK,cr,K,104,true,"Open search Plant PTM Viewer 2.0 - Crotonylation",164c,TBA,,,,,,,,
LSDFGVPGADAKNIFYLR,ub,K,141,true,"upl3 mutant / wildtype",168,35926874,"MaxQuant score",75.8770000,1.0000000,-0.8943219,,,2.6680099836085E-5,0.6206500
AGIASFYE,nt,A,206,true,"Arg/N-end rule seed, prt6 vs. Wt",99,29168982,"MASCOT Score",46.6500000,,-0.0867201,0.8099847,NO,0.01530999969691,0.9160886
GTVASGFTTNSNGEVTEVK,ph,S,236,true,"Tissue atlas Arabidopsis - ProteomicsDB",114,32188942,"MaxQuant score",181.3400000,0.9943070,,,,4.2453598369546E-36,
DQVEEEKGGLK,ub,K,277,true,"upl3 mutant / wildtype",168,35926874,"MaxQuant score",78.3420000,1.0000000,-0.3510744,0.6449800,NO,0.0018841100391001,-0.3939000
FYGDNVGE,nt,F,359,true,"Arg/N-end rule seed, prt6 vs. Wt",99,29168982,"MASCOT Score",37.8100000,,-1.5119179,0.1187289,NO,0.016410000622272,-0.8014893
FGSYWIKER,ac,K,388,true,"Quantitative Acetylproteomics",101,29440448,,,,,,,,
KVVGAFLEGGSPEENNAIAK,ph,S,401,true,"SnRK2 protein kinase substrates",85,23776212,XCorr,2.5175188,1.0000000,,,,0.00038591198972426,
VVGAFLEGGSPEENNAIAK,ph,S,401,true,"Arabidopsis root NAA phosphoproteome",18a,27643528,"MaxQuant Score",40.1370000,1.0000000,,,,0.0010000000474975,-2.1140000
VVGAFLEGGSPEENNAIAK,ph,S,401,true,"SnRK2 protein kinase substrates",85,23776212,XCorr,4.5303822,1.0000000,,,,5.2497199296009E-13,
VVGAFLEGGSPEENNAIAK,ph,S,401,true,"TOR Kinase and ABA Receptor",100,29290610,XCorr,5.8935685,1.0000000,,,,3.4359999290245E-8,
VVGAFLEGGSPEENNAIAK,ph,S,401,true,"Lateral root-induction - NAA vs control",106,23328941,"MASCOT Score",42.0000000,,-0.0405248,0.7773073,NO,,
VVGAFLEGGSPEENNAIAK,ph,S,401,true,"Tissue atlas Arabidopsis - ProteomicsDB",114,32188942,"MaxQuant score",318.8900000,1.0000000,,,,0,
AQPSVESLEVLSK,ph,S,417,true,"Arabidopsis root NAA phosphoproteome",18a,27643528,"MaxQuant Score",41.0880000,0.9730000,,,,0.0020000000949949,1.1960000
AQPSVESLEVLSK,ph,S,417,true,"STN8 phosphoproteome",38,21768351,"MASCOT Score",58.9900000,,,,,,-0.4540250
AQPSVESLEVLSK,ph,S,417,true,"Pollen phosphoproteome Arabidopsis",43,22631563,"MASCOT Score",57.2900000,,,,,,-2.2799900
AQPSVESLEVLSK,ph,S,417,true,"Large-scale phosphorylation discovery",44,23111157,XCorr,3.7330000,,,,,,
AQPSVESLEVLSK,ph,S,417,true,"Phosphoproteome ethylene-regulated time response",46,24043427,"MASCOT Score",39.9300000,,,,,,4.2396000
AQPSVESLEVLSK,ph,S,417,true,"PAMP-triggered phosphorylation",48,24601666,"MASCOT Score",22.4300000,,,,,,
AQPSVESLEVLSK,ph,S,417,true,"Tyrosine phosphorylation in Arabidopsis",59,18463617,"MASCOT Score",27.0000000,,,,,,-1.6374383
AQPSVESLEVLSK,ph,S,417,true,"Chloroplast kinase substrates",60,19376835,"MASCOT Score",39.4300000,,,,,,-0.9445820
AQPSVESLEVLSK,ph,S,417,true,"srk2dei ABA signaling phopshoproteomics",83,23572148,"MASCOT Score",61.0000000,,,,,,-0.0005000
AQPSVESLEVLSK,ph,S,417,true,"LAXIC - ABA stress",84a,23660473,XCorr,3.3000000,0.9990000,,,,4.0999999328051E-5,
AQPSVESLEVLSK,ph,S,417,true,"LAXIC - mannitol vs control",84b,23660473,XCorr,3.1600000,1.0000000,-1.5787642,,NO,2.479999920979E-7,
AQPSVESLEVLSK,ph,S,417,true,"SnRK2 protein kinase substrates",85,23776212,XCorr,3.7761145,1.0000000,,,,4.6404599629568E-7,
AQPSVESLEVLSK,ph,S,417,true,"atm and atr DNA damage response",88,25561503,"MASCOT Score",82.0000000,0.9960000,,,,,-0.3400000
AQPSVESLEVLSK,ph,S,417,true,"TOR Kinase and ABA Receptor",100,29290610,XCorr,2.6962368,0.9996000,,,,6.6150001657661E-5,
AQPSVESLEVLSK,ph,S,417,true,"Lateral root-induction - NAA vs control",106,23328941,"MASCOT Score",62.0000000,,-0.1335636,0.4772849,NO,,
AQPSVESLEVLSK,ph,S,417,true,"Phospho cell culture sucrose/TOR",109,30833711,,,0.9934100,,,,,
AQPSVESLEVLSK,ph,S,417,true,"Col-0 callus - FC Col-0 vs. Col-0 Xray",111a,31410901,,42.6700000,,0.5596593,0.0000000,NO,,0.7912712
AQPSVESLEVLSK,ph,S,417,true,"Col-0 X-ray callus - FC Col-0 vs. Col-0 Xray",111b,31410901,,42.6700000,,0.5596593,0.0000000,NO,,0.7912712
AQPSVESLEVLSK,ph,S,417,true,"atm callus - FC atm vs. atm Xray",111c,31410901,,42.6700000,,0.8519417,0.0000000,NO,,0.7912712
AQPSVESLEVLSK,ph,S,417,true,"atm-3 X-ray callus - FC atm vs. atm Xray",111d,31410901,,42.6700000,,0.8519417,0.0000000,NO,,0.7912712
AQPSVESLEVLSK,ph,S,417,true,"Tissue atlas Arabidopsis - ProteomicsDB",114,32188942,"MaxQuant score",116.8400000,0.9998940,,,,7.9599201853853E-5,
AQPSVESLEVLSK,ph,S,417,true,"Touch-induced phosphorylation: 40s touch vs untouc",136,30291188,"MASCOT score",63.9800000,,-0.0245677,0.8371599,NO,,7.3859683
