Peptide,PTM,ModifiedAA,ModifiedPosition,PeptideUniqueToGene,ExperimentDesc,ExpID,PubmedID,ScoreType,IdentScore,LocProb,Log2FChange,PQ-val,QuantSig,PEP,MassErrorPPM
MEAEIVNVRPQLGFIQR,nta,M,1,true,"HUNTER N-terminome: legumain, GluC and trypsin",119,31951383,"MaxQuant score",68.4810000,,,,,,
MEAEIVNVR,nta,M,1,true,"Arg/N-end rule seed, prt6 vs. Wt",99,29168982,"MASCOT Score",43.8400000,,,,,0.092419996857643,-1.4269330
RNEDESIVRLESR,ph,S,509,true,"Tissue atlas Arabidopsis - ProteomicsDB",114,32188942,"MaxQuant score",48.0530000,0.9984040,,,,0.009038420394063,
IEPMSPVEK,ph,S,598,true,"atm and atr DNA damage response",88,25561503,"MASCOT Score",46.0000000,1.0000000,,,,,-1.7500000
IEPMSPVEK,ph,S,598,true,"Tissue atlas Arabidopsis - ProteomicsDB",114,32188942,"MaxQuant score",128.0100000,1.0000000,,,,0.00015928799984977,
AAPTSNFTVGSDGPPSFR,ph,S,645,true,"STN8 phosphoproteome",38,21768351,"MASCOT Score",115.3700000,,,,,,-0.8991690
AAPTSNFTVGSDGPPSFR,ph,S,645,true,"srk2dei ABA signaling phopshoproteomics",83,23572148,"MASCOT Score",64.0000000,,,,,,0.0006000
AAPTSNFTVGSDGPPSFR,ph,S,645,true,"LAXIC - ABA stress",84a,23660473,XCorr,4.2300000,1.0000000,,,,3.0900000638212E-6,
AAPTSNFTVGSDGPPSFR,ph,S,645,true,"SnRK2 protein kinase substrates",85,23776212,XCorr,3.6889951,1.0000000,,,,2.888410044477E-8,
AAPTSNFTVGSDGPPSFR,ph,S,645,true,"atm and atr DNA damage response",88,25561503,"MASCOT Score",99.0000000,1.0000000,,,,,0.3900000
AAPTSNFTVGSDGPPSFR,ph,S,645,true,"TOR Kinase and ABA Receptor",100,29290610,XCorr,5.5479507,1.0000000,,,,1.8650000654929E-8,
AAPTSNFTVGSDGPPSFR,ph,S,645,true,"Lateral root-induction - NAA vs control",106,23328941,"MASCOT Score",85.0000000,,,,,,
AAPTSNFTVGSDGPPSFR,ph,S,645,true,"Phospho cell culture sucrose/TOR",109,30833711,,,0.9667180,,,,,
AAPTSNFTVGSDGPPSFR,ph,S,645,true,"Col-0 callus - FC Col-0 vs. Col-0 Xray",111a,31410901,,78.7900000,,0.3458111,0.0000000,NO,,1.0572538
AAPTSNFTVGSDGPPSFR,ph,S,645,true,"Col-0 X-ray callus - FC Col-0 vs. Col-0 Xray",111b,31410901,,78.7900000,,0.3458111,0.0000000,NO,,1.0572538
AAPTSNFTVGSDGPPSFR,ph,S,645,true,"atm callus - FC atm vs. atm Xray",111c,31410901,,78.7900000,,0.6684308,0.0000000,NO,,1.0572538
AAPTSNFTVGSDGPPSFR,ph,S,645,true,"atm-3 X-ray callus - FC atm vs. atm Xray",111d,31410901,,78.7900000,,0.6684308,0.0000000,NO,,1.0572538
AAPTSNFTVGSDGPPSFR,ph,S,645,true,"Tissue atlas Arabidopsis - ProteomicsDB",114,32188942,"MaxQuant score",390.7600000,1.0000000,,,,0,
AAPTSNFTVGSDGPPSFR,ph,S,645,true,"Touch-induced phosphorylation: 40s touch vs untouc",136,30291188,"MASCOT score",116.9500000,,-0.6113401,0.4569548,NO,,1.5862100
SLSGEGGSGTGSLSR,ph,S,648,true,"atm and atr DNA damage response",88,25561503,"MASCOT Score",92.0000000,0.9930000,,,,,0.1700000
SLSGEGGSGTGSLSR,ph,S,648,true,"Tissue atlas Arabidopsis - ProteomicsDB",114,32188942,"MaxQuant score",190.4100000,0.9994590,,,,4.7840700716597E-34,
SLSGEGGSGTGSLSR,ph,S,650,true,"atm and atr DNA damage response",88,25561503,"MASCOT Score",74.0000000,0.9890000,,,,,-0.3700000
SLSGEGGSGTGSLSR,ph,S,650,true,"Tissue atlas Arabidopsis - ProteomicsDB",114,32188942,"MaxQuant score",274.3800000,1.0000000,,,,0,
SLSGEGGSGTGSLSR,ph,S,655,true,"Tyrosine phosphorylation in Arabidopsis",59,18463617,"MASCOT Score",22.0000000,,,,,,-1.1883109
SLSGEGGSGTGSLSR,ph,S,655,true,"Conserved plant phosphoproteome - Arabidopsis",61a,20466843,"MASCOT Score",57.0000000,1.0000000,,,,,
SLSGEGGSGTGSLSR,ph,S,655,true,"LAXIC - ABA stress",84a,23660473,XCorr,4.1300000,0.8450000,,,,5.3899999329587E-5,
SLSGEGGSGTGSLSR,ph,S,655,true,"atm and atr DNA damage response",88,25561503,"MASCOT Score",82.0000000,1.0000000,,,,,1.1100000
SLSGEGGSGTGSLSR,ph,S,655,true,"Lateral root-induction - NAA vs control",106,23328941,"MASCOT Score",70.0000000,,,,,,
SLSGEGGSGTGSLSR,ph,S,655,true,"Tissue atlas Arabidopsis - ProteomicsDB",114,32188942,"MaxQuant score",226.0600000,0.9997850,,,,0,
SLSGEGGSGTGSLSR,ph,T,657,true,"SnRK2 protein kinase substrates",85,23776212,XCorr,2.4884496,0.8930000,,,,0.00028361499425955,
SLSGEGGSGTGSLSR,ph,T,657,true,"atm and atr DNA damage response",88,25561503,"MASCOT Score",46.0000000,0.9200000,,,,,-0.4400000
SLSGEGGSGTGSLSR,ph,T,657,true,"Lateral root-induction - NAA vs control",106,23328941,"MASCOT Score",51.0000000,,,,,,
SLSGEGGSGTGSLSR,ph,T,657,true,"Col-0 callus - FC Col-0 vs. Col-0 Xray",111a,31410901,,56.7000000,,0.2526843,0.0000000,NO,,0.0598972
SLSGEGGSGTGSLSR,ph,T,657,true,"Col-0 X-ray callus - FC Col-0 vs. Col-0 Xray",111b,31410901,,56.7000000,,0.2526843,0.0000000,NO,,0.0598972
SLSGEGGSGTGSLSR,ph,T,657,true,"atm callus - FC atm vs. atm Xray",111c,31410901,,56.7000000,,-1.2694685,0.0000000,NO,,0.0598972
SLSGEGGSGTGSLSR,ph,T,657,true,"atm-3 X-ray callus - FC atm vs. atm Xray",111d,31410901,,56.7000000,,-1.2694685,0.0000000,NO,,0.0598972
SLSGEGGSGTGSLSR,ph,T,657,true,"Tissue atlas Arabidopsis - ProteomicsDB",114,32188942,"MaxQuant score",270.2100000,0.9484100,,,,0,
SLSGEGGSGTGSLSR,ph,S,659,true,"STN8 phosphoproteome",38,21768351,"MASCOT Score",48.6300000,,,,,,-0.6005660
SLSGEGGSGTGSLSR,ph,S,659,true,"LAXIC - ABA stress",84a,23660473,XCorr,3.6500000,0.9740000,,,,6.1099999584258E-6,
SLSGEGGSGTGSLSR,ph,S,659,true,"SnRK2 protein kinase substrates",85,23776212,XCorr,2.6656325,0.7930000,,,,0.015061000362039,
SLSGEGGSGTGSLSR,ph,S,659,true,"atm and atr DNA damage response",88,25561503,"MASCOT Score",82.0000000,0.9900000,,,,,1.1100000
SLSGEGGSGTGSLSR,ph,S,659,true,"TOR Kinase and ABA Receptor",100,29290610,XCorr,4.5787406,0.9610000,,,,1.0009999641625E-5,
SLSGEGGSGTGSLSR,ph,S,659,true,"Lateral root-induction - NAA vs control",106,23328941,"MASCOT Score",53.0000000,,,,,,
SLSGEGGSGTGSLSR,ph,S,659,true,"Tissue atlas Arabidopsis - ProteomicsDB",114,32188942,"MaxQuant score",285.9400000,0.9855980,,,,0,
SLSGEGGSGTGSLSR,ph,S,661,true,"Tissue atlas Arabidopsis - ProteomicsDB",114,32188942,"MaxQuant score",127.2900000,0.7617040,,,,2.4871199002519E-6,
ADSFGKDISSGYCMSPTAK,ph,S,719,true,"Tissue atlas Arabidopsis - ProteomicsDB",114,32188942,"MaxQuant score",140.2000000,1.0000000,,,,1.6788900287091E-15,
DISSGYCMSPTAK,ph,S,731,true,"srk2dei ABA signaling phopshoproteomics",83,23572148,"MASCOT Score",37.0000000,,,,,,-0.0026000
DISSGYCMSPTAK,ph,S,731,true,"SnRK2 protein kinase substrates",85,23776212,XCorr,2.4949629,0.9970000,,,,0.00050745601765811,
DISSGYCMSPTAK,ph,S,731,true,"atm and atr DNA damage response",88,25561503,"MASCOT Score",73.0000000,0.9980000,,,,,-0.8100000
DISSGYCMSPTAK,ph,S,731,true,"TOR Kinase and ABA Receptor",100,29290610,XCorr,3.8996546,0.9275000,,,,9.3159997049952E-6,
DISSGYCMSPTAK,ph,S,731,true,"Tissue atlas Arabidopsis - ProteomicsDB",114,32188942,"MaxQuant score",232.1300000,0.9624340,,,,0,
DISSGYCMSPTAK,ph,T,733,true,"Tissue atlas Arabidopsis - ProteomicsDB",114,32188942,"MaxQuant score",169.3000000,0.9770270,,,,4.5973200256172E-15,
TPGSIDSLYGLQR,ph,T,754,true,"Tissue atlas Arabidopsis - ProteomicsDB",114,32188942,"MaxQuant score",179.9300000,0.9998490,,,,2.6752899130008E-21,
TPGSIDSLYGLQR,ph,S,757,true,"STN8 phosphoproteome",38,21768351,"MASCOT Score",98.7100000,,,,,,-1.3903200
TPGSIDSLYGLQR,ph,S,757,true,"srk2dei ABA signaling phopshoproteomics",83,23572148,"MASCOT Score",64.0000000,,,,,,-0.0012000
TPGSIDSLYGLQR,ph,S,757,true,"atm and atr DNA damage response",88,25561503,"MASCOT Score",60.0000000,1.0000000,,,,,0.0500000
TPGSIDSLYGLQR,ph,S,757,true,"TOR Kinase and ABA Receptor",100,29290610,XCorr,3.5666623,0.9991000,,,,3.2430001738248E-5,
TPGSIDSLYGLQR,ph,S,757,true,"Lateral root-induction - NAA vs control",106,23328941,"MASCOT Score",41.0000000,,,,,,
TPGSIDSLYGLQR,ph,S,757,true,"Tissue atlas Arabidopsis - ProteomicsDB",114,32188942,"MaxQuant score",327.1500000,1.0000000,,,,0,
TPGSIDSLYGLQRGSSPSPLVNR,fuc,S,768,true,"SPINDLY O-fucosylation",162,36739885,,,,,,,-0.28000000119209,
GSSPSPLVNR,fuc,S,768,true,"SPINDLY O-fucosylation",162,36739885,,,,,,,0.72000002861023,
GSSPSPLVNR,ph,S,769,true,"Tissue atlas Arabidopsis - ProteomicsDB",114,32188942,"MaxQuant score",104.7900000,0.9903940,,,,0.00029850599821657,
YSSLRAPSSSEGWEHQQPATVHGYQMK,ph,S,801,true,"Tissue atlas Arabidopsis - ProteomicsDB",114,32188942,"MaxQuant score",100.7500000,0.9128580,,,,5.1714199471209E-23,
YSSLRAPSSSEGWEHQQPATVHGYQMK,ph,S,802,true,"Tissue atlas Arabidopsis - ProteomicsDB",114,32188942,"MaxQuant score",221.6400000,0.9986970,,,,0,
APSSSEGWEHQQPATVHGYQMK,fuc,S,807,true,"SPINDLY O-fucosylation",162,36739885,,,,,,,2.2000000476837,
APSSSEGWEHQQPATVHGYQMK,ph,S,807,true,"Tissue atlas Arabidopsis - ProteomicsDB",114,32188942,"MaxQuant score",76.5500000,0.9236030,,,,5.4809299854242E-7,
YSSLRAPSSSEGWEHQQPATVHGYQMK,ph,S,808,true,"TOR Kinase and ABA Receptor",100,29290610,XCorr,4.8230743,0.7557000,,,,0.00085790001321584,
YSSLRAPSSSEGWEHQQPATVHGYQMK,ph,S,809,true,"TOR Kinase and ABA Receptor",100,29290610,XCorr,4.8230743,0.8817000,,,,0.00085790001321584,
APSSSEGWEHQQPATVHGYQMK,ph,T,819,true,"atm and atr DNA damage response",88,25561503,"MASCOT Score",49.0000000,1.0000000,,,,,0.4700000
APSSSEGWEHQQPATVHGYQMK,ph,T,819,true,"TOR Kinase and ABA Receptor",100,29290610,XCorr,4.2529945,0.9993000,,,,6.040000153007E-5,
APSSSEGWEHQQPATVHGYQMK,ph,T,819,true,"Tissue atlas Arabidopsis - ProteomicsDB",114,32188942,"MaxQuant score",274.7000000,1.0000000,,,,0,
QKSQNGLTPGPAPGFENFAGSR,ph,S,871,true,"Tissue atlas Arabidopsis - ProteomicsDB",114,32188942,"MaxQuant score",81.3330000,0.9667630,,,,2.0260600308575E-7,
SQNGLTPGPAPGFENFAGSR,ph,S,871,true,"TOR Kinase and ABA Receptor",100,29290610,XCorr,3.5880358,0.8700000,,,,0.00083380000432953,
SQNGLTPGPAPGFENFAGSR,ph,S,889,true,"Tissue atlas Arabidopsis - ProteomicsDB",114,32188942,"MaxQuant score",78.3240000,0.9978480,,,,5.9474499721546E-5,
SYYGVPSSGNTDTVGAAVANEKK,og,S,906,true,"O-GlcNac Inflorescence Tissue",81,28154133,"MASCOT Score",38.5000000,,,,,,1.3000000
YSSMPDISGLSMSAR,ph,Y,922,true,"TOR Kinase and ABA Receptor",100,29290610,XCorr,2.6095982,0.9623000,,,,0.00058779999380931,
KYSSMPDISGLSMSAR,ph,S,923,true,"Tissue atlas Arabidopsis - ProteomicsDB",114,32188942,"MaxQuant score",186.1500000,0.9293050,,,,1.4675300175634E-27,
KYSSMPDISGLSMSAR,ph,S,924,true,"atm and atr DNA damage response",88,25561503,"MASCOT Score",54.0000000,0.9970000,,,,,-1.1200000
KYSSMPDISGLSMSAR,ph,S,924,true,"TOR Kinase and ABA Receptor",100,29290610,XCorr,4.0313139,0.9048000,,,,1.1490000360936E-5,
YSSMPDISGLSMSAR,ph,S,924,true,"atm and atr DNA damage response",88,25561503,"MASCOT Score",43.0000000,0.9330000,,,,,-0.2200000
YSSMPDISGLSMSAR,ph,S,924,true,"TOR Kinase and ABA Receptor",100,29290610,XCorr,3.2805107,0.8320000,,,,2.0569999833242E-5,
YSSMPDISGLSMSAR,ph,S,924,true,"Phospho cell culture sucrose/TOR",109,30833711,,,0.9609100,,,,,
YSSMPDISGLSMSAR,ph,S,924,true,"Tissue atlas Arabidopsis - ProteomicsDB",114,32188942,"MaxQuant score",247.3000000,0.9999640,,,,0,
SGYWDPSSGGGGYGASYGR,ph,S,945,true,"Tissue atlas Arabidopsis - ProteomicsDB",114,32188942,"MaxQuant score",143.3900000,0.9772020,,,,1.2644899920223E-17,
SGYWDPSSGGGGYGASYGR,ph,S,960,true,"Tissue atlas Arabidopsis - ProteomicsDB",114,32188942,"MaxQuant score",163.6200000,0.9999950,,,,1.2871099967974E-22,
LSNESSLYSNLGSR,ph,S,969,true,"Tissue atlas Arabidopsis - ProteomicsDB",114,32188942,"MaxQuant score",77.5620000,0.8278980,,,,0.00059818499721587,
LSNESSLYSNLGSR,ph,S,976,true,"Tissue atlas Arabidopsis - ProteomicsDB",114,32188942,"MaxQuant score",143.7500000,0.9980700,,,,3.8464800233839E-9,
VGVPSTYDDISQSR,fuc,S,982,true,"SPINDLY O-fucosylation",162,36739885,,,,,,,1.7000000476837,
VGVPSTYDDISQSR,ph,T,983,true,"Tissue atlas Arabidopsis - ProteomicsDB",114,32188942,"MaxQuant score",175.8800000,0.9906360,,,,7.2671297588801E-16,
VGVPSTYDDISQSR,fuc,S,990,true,"SPINDLY O-fucosylation",162,36739885,,,,,,,-1,
GGYRDAYSLPQSATTGTGSLWSRQPFEQFGVAER,fuc,S,999,true,"SPINDLY O-fucosylation",162,36739885,,,,,,,0.61000001430511,
DAYSLPQSATTGTGSLWSRQPFEQFGVAER,fuc,S,999,true,"SPINDLY O-fucosylation",162,36739885,,,,,,,0.21999999880791,
GGYRDAYSLPQSATTGTGSLWSR,fuc,S,999,true,"SPINDLY O-fucosylation",162,36739885,,,,,,,-1.2999999523163,
QPFEQFGVAER,nt,Q,1015,true,"HUNTER N-terminome: legumain, GluC and trypsin",119,31951383,"MaxQuant score",80.9790000,,,,,,
ASPTSANGMLPPAAKPAK,ph,S,1199,true,"Tissue atlas Arabidopsis - ProteomicsDB",114,32188942,"MaxQuant score",241.7900000,0.9992350,,,,0,
ASPTSANGMLPPAAK,ph,S,1199,true,"atm and atr DNA damage response",88,25561503,"MASCOT Score",72.0000000,0.9970000,,,,,0.5300000
LSNKPVGMNQDGPGSRK,ph,S,1283,true,"TOR Kinase and ABA Receptor",100,29290610,XCorr,3.2788162,1.0000000,,,,0.10339999943972,
LSNKPVGMNQDGPGSRK,ph,S,1283,true,"Tissue atlas Arabidopsis - ProteomicsDB",114,32188942,"MaxQuant score",184.9700000,1.0000000,,,,1.8713900735525E-26,
LSNKPVGMNQDGPGSR,ph,S,1283,true,"atm and atr DNA damage response",88,25561503,"MASCOT Score",48.0000000,1.0000000,,,,,0.4400000
KNVTAYGSLG,ph,S,1292,true,"atm and atr DNA damage response",88,25561503,"MASCOT Score",43.0000000,1.0000000,,,,,-1.0300000
KNVTAYGSLG,ph,S,1292,true,"Tissue atlas Arabidopsis - ProteomicsDB",114,32188942,"MaxQuant score",96.0090000,1.0000000,,,,0.00041416200110689,
NVTAYGSLG,ph,S,1292,true,"atm and atr DNA damage response",88,25561503,"MASCOT Score",46.0000000,1.0000000,,,,,0.0600000
