Peptide,PTM,ModifiedAA,ModifiedPosition,PeptideUniqueToGene,ExperimentDesc,ExpID,PubmedID,ScoreType,IdentScore,LocProb,Log2FChange,PQ-val,QuantSig,PEP,MassErrorPPM
MQIFVK,mox,M,1,false,"cat2 Methionine oxidation - 1h stress",62a,25693801,"MASCOT Score",36.0000000,,0.0320090,,NO,,
MQIFVK,mox,M,1,false,"cat2 Methionine oxidation - 3h stress",62b,25693801,"MASCOT Score",36.0000000,,0.0603850,,NO,,
MQIFVKTLTGK,ac,K,6,false,"Histone deacetylases - apicidin vs control",98a,29061669,"MaxQuant Score",52.5000000,1.0000000,0.1250000,0.5248075,NO,0.0089999996125698,
MQIFVKTLTGK,ac,K,6,false,"Quantitative Acetylproteomics",101,29440448,,,,,,,,
VKTLTGK,ac,K,6,false,"Quantitative Acetylproteomics",101,29440448,,,,,,,,
MQIFVKTLTGK,ub,K,6,false,"TAP 6xHis-tag Ub",1,19292762,XCorr,3.8400000,,,,,,
MQIFVKTLTGK,ub,K,6,false,"Ubiquitination Membrane Proteins",120,33585938,,,,,,,,
MQIFVKTLTGK,ub,K,6,false,"upl3 mutant / wildtype",168,35926874,"MaxQuant score",144.2700000,1.0000000,-0.2584252,0.7437600,NO,4.4164298884652E-9,2.4383000
KTITLEVESS,nt,K,11,false,"Arabidopsis translation initiation landscape - NT",167b,35069635,,,,,,,,
TLTGKTITLEVESSDTIDNVKAK,ub,K,11,false,"Ubiquitination Membrane Proteins",120,33585938,,,,,,,,
TLTGKTITLEVESSDTIDNVK,ub,K,11,false,"TAP 6xHis-tag Ub",1,19292762,XCorr,4.5800000,,,,,,
TLTGKTITLEVESSDTIDNVK,ub,K,11,false,"MudPIT plant ubiquitination",103,17272265,XCorr,6.8700000,,,,,,
TLTGKTITLEVESSDTIDNVK,ub,K,11,false,"Ubiquitination Membrane Proteins",120,33585938,,,,,,,,
TLTGKTITLEVESSDTIDNVK,ub,K,11,false,"upl3 mutant / wildtype",168,35926874,"MaxQuant score",269.9000000,1.0000000,0.6443178,0.6861200,NO,0,-0.0984030
TITLEVESSDTIDNVKAK,hib,K,27,false,"Open search Plant PTM Viewer 2.0 - hib",164e,TBA,,,,,,,,
TITLEVESSDTIDNVKAK,ub,K,27,false,"Ubiquitination Membrane Proteins",120,33585938,,,,,,,,
TITLEVESSDTIDNVKAK,ub,K,27,false,"upl3 mutant / wildtype",168,35926874,"MaxQuant score",154.4600000,1.0000000,0.0412430,,,1.3006400543676E-19,-2.2282000
AKIQDKEGIPPDQQR,ub,K,29,false,"TAP 6xHis-tag Ub",1,19292762,XCorr,5.1800000,,,,,,
AKIQDKEGIPPDQQR,ub,K,29,false,"MudPIT plant ubiquitination",103,17272265,XCorr,4.8500000,,,,,,
AKIQDKEGIPPDQQR,ub,K,29,false,"Ubiquitination Membrane Proteins",120,33585938,,,,,,,,
AKIQDKEGIPPDQQR,ub,K,29,false,"upl3 mutant / wildtype",168,35926874,"MaxQuant score",191.3700000,1.0000000,-0.9050884,0.0873230,NO,3.1904601087609E-26,0.8811800
IQDKEGIPPDQQR,cr,K,33,false,"Open search Plant PTM Viewer 2.0 - Crotonylation",164c,TBA,,,,,,,,
AKIQDKEGIPPDQQR,ub,K,33,false,"TAP 6xHis-tag Ub",1,19292762,XCorr,5.1800000,,,,,,
AKIQDKEGIPPDQQR,ub,K,33,false,"Ubiquitination Membrane Proteins",120,33585938,,,,,,,,
AKIQDKEGIPPDQQR,ub,K,33,false,"upl3 mutant / wildtype",168,35926874,"MaxQuant score",191.3700000,1.0000000,-0.9050884,0.0873230,NO,3.1904601087609E-26,0.8811800
IQDKEGIPPDQQR,ub,K,33,false,"TAP 6xHis-tag Ub",1,19292762,XCorr,2.5500000,,,,,,
IQDKEGIPPDQQR,ub,K,33,false,"MudPIT plant ubiquitination",103,17272265,XCorr,3.5000000,,,,,,
IQDKEGIPPDQQR,ub,K,33,false,"upl3 mutant / wildtype",168,35926874,"MaxQuant score",161.2100000,1.0000000,0.1557492,0.6283600,NO,3.8044298478679E-15,0.4472800
LIFAGKQLEDGR,nt,L,43,false,"Arabidopsis translation initiation landscape - NT",167b,35069635,,,,,,,,
LIFAGKQLEDGR,ac,K,48,false,"Histone deacetylases - apicidin vs control",98a,29061669,"MaxQuant Score",76.1000000,1.0000000,-0.2060000,0.2404363,NO,0.00063000002410263,
LIFAGKQLEDGR,ac,K,48,false,"Quantitative Acetylproteomics",101,29440448,,,,,,,,
LIFAGKQLEDGR,cr,K,48,false,"Open search Plant PTM Viewer 2.0 - Crotonylation",164c,TBA,,,,,,,,
LIFAGKQLEDGR,me2,K,48,false,"Arabidopsis protein methylome",123,31809900,"MaxQuant Score",158.5800000,1.0000000,,,,2.8025969286496E-45,0.3884500
LIFAGKQLEDGRTLADYNIQK,ub,K,48,false,"TAP 6xHis-tag Ub",1,19292762,XCorr,4.9900000,,,,,,
LIFAGKQLEDGRTLADYNIQK,ub,K,48,false,"Ubiquitination Membrane Proteins",120,33585938,,,,,,,,
LIFAGKQLEDGRTLADYNIQK,ub,K,48,false,"upl3 mutant / wildtype",168,35926874,"MaxQuant score",146.1600000,1.0000000,-0.2653446,0.4625600,NO,6.3510802172928E-10,1.5675000
LIFAGKQLEDGR,ub,K,48,false,"TAP 6xHis-tag Ub",1,19292762,XCorr,4.3200000,,,,,,
LIFAGKQLEDGR,ub,K,48,false,"Arabidopsis ubiquitination COFRADIC",40,26744219,"MaxQuant Score",166.0400000,1.0000000,,,,0,-0.6820000
LIFAGKQLEDGR,ub,K,48,false,"MudPIT plant ubiquitination",103,17272265,XCorr,4.6000000,,,,,,
LIFAGKQLEDGR,ub,K,48,false,"Ubiquitination Membrane Proteins",120,33585938,,,,,,,,
LIFAGKQLEDGR,ub,K,48,false,"upl3 mutant / wildtype",168,35926874,"MaxQuant score",146.1600000,1.0000000,-0.2653446,0.4625600,NO,6.3510802172928E-10,-1.3821000
QLEDGRTLADYNIQKESTLHLVLR,ub,K,63,false,"Ubiquitination Membrane Proteins",120,33585938,,,,,,,,
TLADYNIQKESTLHLVLR,ub,K,63,false,"TAP 6xHis-tag Ub",1,19292762,XCorr,2.8400000,,,,,,
TLADYNIQKESTLHLVLR,ub,K,63,false,"MudPIT plant ubiquitination",103,17272265,XCorr,5.3000000,,,,,,
TLADYNIQKESTLHLVLR,ub,K,63,false,"Ubiquitination Membrane Proteins",120,33585938,,,,,,,,
TLADYNIQKESTLHLVLR,ub,K,63,false,"upl3 mutant / wildtype",168,35926874,"MaxQuant score",366.9900000,1.0000000,-0.2042331,0.6076800,NO,0,-0.1877200
ESTLHLVLR,ph,S,65,false,"atm and atr DNA damage response",88,25561503,"MASCOT Score",27.0000000,0.9970000,,,,,1.4600000
ESTLHLVLR,ph,T,66,false,"Tissue atlas Arabidopsis - ProteomicsDB",114,32188942,"MaxQuant score",130.5300000,0.9963610,,,,0.00032401300268248,
MQIFVK,mox,M,77,false,"cat2 Methionine oxidation - 1h stress",62a,25693801,"MASCOT Score",36.0000000,,0.0320090,,NO,,
MQIFVK,mox,M,77,false,"cat2 Methionine oxidation - 3h stress",62b,25693801,"MASCOT Score",36.0000000,,0.0603850,,NO,,
MQIFVKTLTGKTITLE,nt,M,77,false,"Arabidopsis translation initiation landscape - NT",167b,35069635,,,,,,,,
MQIFVKTLTGK,ac,K,82,false,"Histone deacetylases - apicidin vs control",98a,29061669,"MaxQuant Score",52.5000000,1.0000000,0.1250000,0.5248075,NO,0.0089999996125698,
MQIFVKTLTGK,ac,K,82,false,"Quantitative Acetylproteomics",101,29440448,,,,,,,,
VKTLTGK,ac,K,82,false,"Quantitative Acetylproteomics",101,29440448,,,,,,,,
MQIFVKTLTGK,ub,K,82,false,"TAP 6xHis-tag Ub",1,19292762,XCorr,3.8400000,,,,,,
MQIFVKTLTGK,ub,K,82,false,"Ubiquitination Membrane Proteins",120,33585938,,,,,,,,
MQIFVKTLTGK,ub,K,82,false,"upl3 mutant / wildtype",168,35926874,"MaxQuant score",144.2700000,1.0000000,-0.2584252,0.7437600,NO,4.4164298884652E-9,2.4383000
KTITLEVESS,nt,K,87,false,"Arabidopsis translation initiation landscape - NT",167b,35069635,,,,,,,,
TLTGKTITLEVESSDTIDNVKAK,ub,K,87,false,"Ubiquitination Membrane Proteins",120,33585938,,,,,,,,
TLTGKTITLEVESSDTIDNVK,ub,K,87,false,"TAP 6xHis-tag Ub",1,19292762,XCorr,4.5800000,,,,,,
TLTGKTITLEVESSDTIDNVK,ub,K,87,false,"MudPIT plant ubiquitination",103,17272265,XCorr,6.8700000,,,,,,
TLTGKTITLEVESSDTIDNVK,ub,K,87,false,"Ubiquitination Membrane Proteins",120,33585938,,,,,,,,
TLTGKTITLEVESSDTIDNVK,ub,K,87,false,"upl3 mutant / wildtype",168,35926874,"MaxQuant score",269.9000000,1.0000000,0.6443178,0.6861200,NO,0,-0.0984030
TITLEVESSDTIDNVKAK,hib,K,103,false,"Open search Plant PTM Viewer 2.0 - hib",164e,TBA,,,,,,,,
TITLEVESSDTIDNVKAK,ub,K,103,false,"Ubiquitination Membrane Proteins",120,33585938,,,,,,,,
TITLEVESSDTIDNVKAK,ub,K,103,false,"upl3 mutant / wildtype",168,35926874,"MaxQuant score",154.4600000,1.0000000,0.0412430,,,1.3006400543676E-19,-2.2282000
AKIQDKEGIPPDQQR,ub,K,105,false,"TAP 6xHis-tag Ub",1,19292762,XCorr,5.1800000,,,,,,
AKIQDKEGIPPDQQR,ub,K,105,false,"MudPIT plant ubiquitination",103,17272265,XCorr,4.8500000,,,,,,
AKIQDKEGIPPDQQR,ub,K,105,false,"Ubiquitination Membrane Proteins",120,33585938,,,,,,,,
AKIQDKEGIPPDQQR,ub,K,105,false,"upl3 mutant / wildtype",168,35926874,"MaxQuant score",191.3700000,1.0000000,-0.9050884,0.0873230,NO,3.1904601087609E-26,0.8811800
IQDKEGIPPDQQR,cr,K,109,false,"Open search Plant PTM Viewer 2.0 - Crotonylation",164c,TBA,,,,,,,,
AKIQDKEGIPPDQQR,ub,K,109,false,"TAP 6xHis-tag Ub",1,19292762,XCorr,5.1800000,,,,,,
AKIQDKEGIPPDQQR,ub,K,109,false,"Ubiquitination Membrane Proteins",120,33585938,,,,,,,,
AKIQDKEGIPPDQQR,ub,K,109,false,"upl3 mutant / wildtype",168,35926874,"MaxQuant score",191.3700000,1.0000000,-0.9050884,0.0873230,NO,3.1904601087609E-26,0.8811800
IQDKEGIPPDQQR,ub,K,109,false,"TAP 6xHis-tag Ub",1,19292762,XCorr,2.5500000,,,,,,
IQDKEGIPPDQQR,ub,K,109,false,"MudPIT plant ubiquitination",103,17272265,XCorr,3.5000000,,,,,,
IQDKEGIPPDQQR,ub,K,109,false,"upl3 mutant / wildtype",168,35926874,"MaxQuant score",161.2100000,1.0000000,0.1557492,0.6283600,NO,3.8044298478679E-15,0.4472800
LIFAGKQLEDGR,nt,L,119,false,"Arabidopsis translation initiation landscape - NT",167b,35069635,,,,,,,,
LIFAGKQLEDGR,ac,K,124,false,"Histone deacetylases - apicidin vs control",98a,29061669,"MaxQuant Score",76.1000000,1.0000000,-0.2060000,0.2404363,NO,0.00063000002410263,
LIFAGKQLEDGR,ac,K,124,false,"Quantitative Acetylproteomics",101,29440448,,,,,,,,
LIFAGKQLEDGR,cr,K,124,false,"Open search Plant PTM Viewer 2.0 - Crotonylation",164c,TBA,,,,,,,,
LIFAGKQLEDGR,me2,K,124,false,"Arabidopsis protein methylome",123,31809900,"MaxQuant Score",158.5800000,1.0000000,,,,2.8025969286496E-45,0.3884500
LIFAGKQLEDGRTLADYNIQK,ub,K,124,false,"TAP 6xHis-tag Ub",1,19292762,XCorr,4.9900000,,,,,,
LIFAGKQLEDGRTLADYNIQK,ub,K,124,false,"Ubiquitination Membrane Proteins",120,33585938,,,,,,,,
LIFAGKQLEDGRTLADYNIQK,ub,K,124,false,"upl3 mutant / wildtype",168,35926874,"MaxQuant score",146.1600000,1.0000000,-0.2653446,0.4625600,NO,6.3510802172928E-10,1.5675000
LIFAGKQLEDGR,ub,K,124,false,"TAP 6xHis-tag Ub",1,19292762,XCorr,4.3200000,,,,,,
LIFAGKQLEDGR,ub,K,124,false,"Arabidopsis ubiquitination COFRADIC",40,26744219,"MaxQuant Score",166.0400000,1.0000000,,,,0,-0.6820000
LIFAGKQLEDGR,ub,K,124,false,"MudPIT plant ubiquitination",103,17272265,XCorr,4.6000000,,,,,,
LIFAGKQLEDGR,ub,K,124,false,"Ubiquitination Membrane Proteins",120,33585938,,,,,,,,
LIFAGKQLEDGR,ub,K,124,false,"upl3 mutant / wildtype",168,35926874,"MaxQuant score",146.1600000,1.0000000,-0.2653446,0.4625600,NO,6.3510802172928E-10,-1.3821000
QLEDGRTLADYNIQKESTLHLVLR,ub,K,139,false,"Ubiquitination Membrane Proteins",120,33585938,,,,,,,,
TLADYNIQKESTLHLVLR,ub,K,139,false,"TAP 6xHis-tag Ub",1,19292762,XCorr,2.8400000,,,,,,
TLADYNIQKESTLHLVLR,ub,K,139,false,"MudPIT plant ubiquitination",103,17272265,XCorr,5.3000000,,,,,,
TLADYNIQKESTLHLVLR,ub,K,139,false,"Ubiquitination Membrane Proteins",120,33585938,,,,,,,,
TLADYNIQKESTLHLVLR,ub,K,139,false,"upl3 mutant / wildtype",168,35926874,"MaxQuant score",366.9900000,1.0000000,-0.2042331,0.6076800,NO,0,-0.1877200
ESTLHLVLR,ph,S,141,false,"atm and atr DNA damage response",88,25561503,"MASCOT Score",27.0000000,0.9970000,,,,,1.4600000
ESTLHLVLR,ph,T,142,false,"Tissue atlas Arabidopsis - ProteomicsDB",114,32188942,"MaxQuant score",130.5300000,0.9963610,,,,0.00032401300268248,
MQIFVK,mox,M,153,false,"cat2 Methionine oxidation - 1h stress",62a,25693801,"MASCOT Score",36.0000000,,0.0320090,,NO,,
MQIFVK,mox,M,153,false,"cat2 Methionine oxidation - 3h stress",62b,25693801,"MASCOT Score",36.0000000,,0.0603850,,NO,,
MQIFVKTLTGKTITLE,nt,M,153,false,"Arabidopsis translation initiation landscape - NT",167b,35069635,,,,,,,,
MQIFVKTLTGK,ac,K,158,false,"Histone deacetylases - apicidin vs control",98a,29061669,"MaxQuant Score",52.5000000,1.0000000,0.1250000,0.5248075,NO,0.0089999996125698,
MQIFVKTLTGK,ac,K,158,false,"Quantitative Acetylproteomics",101,29440448,,,,,,,,
VKTLTGK,ac,K,158,false,"Quantitative Acetylproteomics",101,29440448,,,,,,,,
MQIFVKTLTGK,ub,K,158,false,"TAP 6xHis-tag Ub",1,19292762,XCorr,3.8400000,,,,,,
MQIFVKTLTGK,ub,K,158,false,"Ubiquitination Membrane Proteins",120,33585938,,,,,,,,
MQIFVKTLTGK,ub,K,158,false,"upl3 mutant / wildtype",168,35926874,"MaxQuant score",144.2700000,1.0000000,-0.2584252,0.7437600,NO,4.4164298884652E-9,2.4383000
KTITLEVESS,nt,K,163,false,"Arabidopsis translation initiation landscape - NT",167b,35069635,,,,,,,,
TLTGKTITLEVESSDTIDNVKAK,ub,K,163,false,"Ubiquitination Membrane Proteins",120,33585938,,,,,,,,
TLTGKTITLEVESSDTIDNVK,ub,K,163,false,"TAP 6xHis-tag Ub",1,19292762,XCorr,4.5800000,,,,,,
TLTGKTITLEVESSDTIDNVK,ub,K,163,false,"MudPIT plant ubiquitination",103,17272265,XCorr,6.8700000,,,,,,
TLTGKTITLEVESSDTIDNVK,ub,K,163,false,"Ubiquitination Membrane Proteins",120,33585938,,,,,,,,
TLTGKTITLEVESSDTIDNVK,ub,K,163,false,"upl3 mutant / wildtype",168,35926874,"MaxQuant score",269.9000000,1.0000000,0.6443178,0.6861200,NO,0,-0.0984030
TITLEVESSDTIDNVKAK,hib,K,179,false,"Open search Plant PTM Viewer 2.0 - hib",164e,TBA,,,,,,,,
TITLEVESSDTIDNVKAK,ub,K,179,false,"Ubiquitination Membrane Proteins",120,33585938,,,,,,,,
TITLEVESSDTIDNVKAK,ub,K,179,false,"upl3 mutant / wildtype",168,35926874,"MaxQuant score",154.4600000,1.0000000,0.0412430,,,1.3006400543676E-19,-2.2282000
AKIQDKEGIPPDQQR,ub,K,181,false,"TAP 6xHis-tag Ub",1,19292762,XCorr,5.1800000,,,,,,
AKIQDKEGIPPDQQR,ub,K,181,false,"MudPIT plant ubiquitination",103,17272265,XCorr,4.8500000,,,,,,
AKIQDKEGIPPDQQR,ub,K,181,false,"Ubiquitination Membrane Proteins",120,33585938,,,,,,,,
AKIQDKEGIPPDQQR,ub,K,181,false,"upl3 mutant / wildtype",168,35926874,"MaxQuant score",191.3700000,1.0000000,-0.9050884,0.0873230,NO,3.1904601087609E-26,0.8811800
IQDKEGIPPDQQR,cr,K,185,false,"Open search Plant PTM Viewer 2.0 - Crotonylation",164c,TBA,,,,,,,,
AKIQDKEGIPPDQQR,ub,K,185,false,"TAP 6xHis-tag Ub",1,19292762,XCorr,5.1800000,,,,,,
AKIQDKEGIPPDQQR,ub,K,185,false,"Ubiquitination Membrane Proteins",120,33585938,,,,,,,,
AKIQDKEGIPPDQQR,ub,K,185,false,"upl3 mutant / wildtype",168,35926874,"MaxQuant score",191.3700000,1.0000000,-0.9050884,0.0873230,NO,3.1904601087609E-26,0.8811800
IQDKEGIPPDQQR,ub,K,185,false,"TAP 6xHis-tag Ub",1,19292762,XCorr,2.5500000,,,,,,
IQDKEGIPPDQQR,ub,K,185,false,"MudPIT plant ubiquitination",103,17272265,XCorr,3.5000000,,,,,,
IQDKEGIPPDQQR,ub,K,185,false,"upl3 mutant / wildtype",168,35926874,"MaxQuant score",161.2100000,1.0000000,0.1557492,0.6283600,NO,3.8044298478679E-15,0.4472800
LIFAGKQLEDGR,nt,L,195,false,"Arabidopsis translation initiation landscape - NT",167b,35069635,,,,,,,,
LIFAGKQLEDGR,ac,K,200,false,"Histone deacetylases - apicidin vs control",98a,29061669,"MaxQuant Score",76.1000000,1.0000000,-0.2060000,0.2404363,NO,0.00063000002410263,
LIFAGKQLEDGR,ac,K,200,false,"Quantitative Acetylproteomics",101,29440448,,,,,,,,
LIFAGKQLEDGR,cr,K,200,false,"Open search Plant PTM Viewer 2.0 - Crotonylation",164c,TBA,,,,,,,,
LIFAGKQLEDGR,me2,K,200,false,"Arabidopsis protein methylome",123,31809900,"MaxQuant Score",158.5800000,1.0000000,,,,2.8025969286496E-45,0.3884500
LIFAGKQLEDGRTLADYNIQK,ub,K,200,false,"TAP 6xHis-tag Ub",1,19292762,XCorr,4.9900000,,,,,,
LIFAGKQLEDGRTLADYNIQK,ub,K,200,false,"Ubiquitination Membrane Proteins",120,33585938,,,,,,,,
LIFAGKQLEDGRTLADYNIQK,ub,K,200,false,"upl3 mutant / wildtype",168,35926874,"MaxQuant score",146.1600000,1.0000000,-0.2653446,0.4625600,NO,6.3510802172928E-10,1.5675000
LIFAGKQLEDGR,ub,K,200,false,"TAP 6xHis-tag Ub",1,19292762,XCorr,4.3200000,,,,,,
LIFAGKQLEDGR,ub,K,200,false,"Arabidopsis ubiquitination COFRADIC",40,26744219,"MaxQuant Score",166.0400000,1.0000000,,,,0,-0.6820000
LIFAGKQLEDGR,ub,K,200,false,"MudPIT plant ubiquitination",103,17272265,XCorr,4.6000000,,,,,,
LIFAGKQLEDGR,ub,K,200,false,"Ubiquitination Membrane Proteins",120,33585938,,,,,,,,
LIFAGKQLEDGR,ub,K,200,false,"upl3 mutant / wildtype",168,35926874,"MaxQuant score",146.1600000,1.0000000,-0.2653446,0.4625600,NO,6.3510802172928E-10,-1.3821000
QLEDGRTLADYNIQKESTLHLVLR,ub,K,215,false,"Ubiquitination Membrane Proteins",120,33585938,,,,,,,,
TLADYNIQKESTLHLVLR,ub,K,215,false,"TAP 6xHis-tag Ub",1,19292762,XCorr,2.8400000,,,,,,
TLADYNIQKESTLHLVLR,ub,K,215,false,"MudPIT plant ubiquitination",103,17272265,XCorr,5.3000000,,,,,,
TLADYNIQKESTLHLVLR,ub,K,215,false,"Ubiquitination Membrane Proteins",120,33585938,,,,,,,,
TLADYNIQKESTLHLVLR,ub,K,215,false,"upl3 mutant / wildtype",168,35926874,"MaxQuant score",366.9900000,1.0000000,-0.2042331,0.6076800,NO,0,-0.1877200
ESTLHLVLR,ph,S,217,false,"atm and atr DNA damage response",88,25561503,"MASCOT Score",27.0000000,0.9970000,,,,,1.4600000
ESTLHLVLR,ph,T,218,false,"Tissue atlas Arabidopsis - ProteomicsDB",114,32188942,"MaxQuant score",130.5300000,0.9963610,,,,0.00032401300268248,
MQIFVK,mox,M,229,false,"cat2 Methionine oxidation - 1h stress",62a,25693801,"MASCOT Score",36.0000000,,0.0320090,,NO,,
MQIFVK,mox,M,229,false,"cat2 Methionine oxidation - 3h stress",62b,25693801,"MASCOT Score",36.0000000,,0.0603850,,NO,,
MQIFVKTLTGKTITLE,nt,M,229,false,"Arabidopsis translation initiation landscape - NT",167b,35069635,,,,,,,,
MQIFVKTLTGK,ac,K,234,false,"Histone deacetylases - apicidin vs control",98a,29061669,"MaxQuant Score",52.5000000,1.0000000,0.1250000,0.5248075,NO,0.0089999996125698,
MQIFVKTLTGK,ac,K,234,false,"Quantitative Acetylproteomics",101,29440448,,,,,,,,
VKTLTGK,ac,K,234,false,"Quantitative Acetylproteomics",101,29440448,,,,,,,,
MQIFVKTLTGK,ub,K,234,false,"TAP 6xHis-tag Ub",1,19292762,XCorr,3.8400000,,,,,,
MQIFVKTLTGK,ub,K,234,false,"Ubiquitination Membrane Proteins",120,33585938,,,,,,,,
MQIFVKTLTGK,ub,K,234,false,"upl3 mutant / wildtype",168,35926874,"MaxQuant score",144.2700000,1.0000000,-0.2584252,0.7437600,NO,4.4164298884652E-9,2.4383000
KTITLEVESS,nt,K,239,false,"Arabidopsis translation initiation landscape - NT",167b,35069635,,,,,,,,
TLTGKTITLEVESSDTIDNVKAK,ub,K,239,false,"Ubiquitination Membrane Proteins",120,33585938,,,,,,,,
TLTGKTITLEVESSDTIDNVK,ub,K,239,false,"TAP 6xHis-tag Ub",1,19292762,XCorr,4.5800000,,,,,,
TLTGKTITLEVESSDTIDNVK,ub,K,239,false,"MudPIT plant ubiquitination",103,17272265,XCorr,6.8700000,,,,,,
TLTGKTITLEVESSDTIDNVK,ub,K,239,false,"Ubiquitination Membrane Proteins",120,33585938,,,,,,,,
TLTGKTITLEVESSDTIDNVK,ub,K,239,false,"upl3 mutant / wildtype",168,35926874,"MaxQuant score",269.9000000,1.0000000,0.6443178,0.6861200,NO,0,-0.0984030
TITLEVESSDTIDNVKAK,hib,K,255,false,"Open search Plant PTM Viewer 2.0 - hib",164e,TBA,,,,,,,,
TITLEVESSDTIDNVKAK,ub,K,255,false,"Ubiquitination Membrane Proteins",120,33585938,,,,,,,,
TITLEVESSDTIDNVKAK,ub,K,255,false,"upl3 mutant / wildtype",168,35926874,"MaxQuant score",154.4600000,1.0000000,0.0412430,,,1.3006400543676E-19,-2.2282000
AKIQDKEGIPPDQQR,ub,K,257,false,"TAP 6xHis-tag Ub",1,19292762,XCorr,5.1800000,,,,,,
AKIQDKEGIPPDQQR,ub,K,257,false,"MudPIT plant ubiquitination",103,17272265,XCorr,4.8500000,,,,,,
AKIQDKEGIPPDQQR,ub,K,257,false,"Ubiquitination Membrane Proteins",120,33585938,,,,,,,,
AKIQDKEGIPPDQQR,ub,K,257,false,"upl3 mutant / wildtype",168,35926874,"MaxQuant score",191.3700000,1.0000000,-0.9050884,0.0873230,NO,3.1904601087609E-26,0.8811800
IQDKEGIPPDQQR,cr,K,261,false,"Open search Plant PTM Viewer 2.0 - Crotonylation",164c,TBA,,,,,,,,
AKIQDKEGIPPDQQR,ub,K,261,false,"TAP 6xHis-tag Ub",1,19292762,XCorr,5.1800000,,,,,,
AKIQDKEGIPPDQQR,ub,K,261,false,"Ubiquitination Membrane Proteins",120,33585938,,,,,,,,
AKIQDKEGIPPDQQR,ub,K,261,false,"upl3 mutant / wildtype",168,35926874,"MaxQuant score",191.3700000,1.0000000,-0.9050884,0.0873230,NO,3.1904601087609E-26,0.8811800
IQDKEGIPPDQQR,ub,K,261,false,"TAP 6xHis-tag Ub",1,19292762,XCorr,2.5500000,,,,,,
IQDKEGIPPDQQR,ub,K,261,false,"MudPIT plant ubiquitination",103,17272265,XCorr,3.5000000,,,,,,
IQDKEGIPPDQQR,ub,K,261,false,"upl3 mutant / wildtype",168,35926874,"MaxQuant score",161.2100000,1.0000000,0.1557492,0.6283600,NO,3.8044298478679E-15,0.4472800
LIFAGKQLEDGR,nt,L,271,false,"Arabidopsis translation initiation landscape - NT",167b,35069635,,,,,,,,
LIFAGKQLEDGR,ac,K,276,false,"Histone deacetylases - apicidin vs control",98a,29061669,"MaxQuant Score",76.1000000,1.0000000,-0.2060000,0.2404363,NO,0.00063000002410263,
LIFAGKQLEDGR,ac,K,276,false,"Quantitative Acetylproteomics",101,29440448,,,,,,,,
LIFAGKQLEDGR,cr,K,276,false,"Open search Plant PTM Viewer 2.0 - Crotonylation",164c,TBA,,,,,,,,
LIFAGKQLEDGR,me2,K,276,false,"Arabidopsis protein methylome",123,31809900,"MaxQuant Score",158.5800000,1.0000000,,,,2.8025969286496E-45,0.3884500
LIFAGKQLEDGRTLADYNIQK,ub,K,276,false,"TAP 6xHis-tag Ub",1,19292762,XCorr,4.9900000,,,,,,
LIFAGKQLEDGRTLADYNIQK,ub,K,276,false,"Ubiquitination Membrane Proteins",120,33585938,,,,,,,,
LIFAGKQLEDGRTLADYNIQK,ub,K,276,false,"upl3 mutant / wildtype",168,35926874,"MaxQuant score",146.1600000,1.0000000,-0.2653446,0.4625600,NO,6.3510802172928E-10,1.5675000
LIFAGKQLEDGR,ub,K,276,false,"TAP 6xHis-tag Ub",1,19292762,XCorr,4.3200000,,,,,,
LIFAGKQLEDGR,ub,K,276,false,"Arabidopsis ubiquitination COFRADIC",40,26744219,"MaxQuant Score",166.0400000,1.0000000,,,,0,-0.6820000
LIFAGKQLEDGR,ub,K,276,false,"MudPIT plant ubiquitination",103,17272265,XCorr,4.6000000,,,,,,
LIFAGKQLEDGR,ub,K,276,false,"Ubiquitination Membrane Proteins",120,33585938,,,,,,,,
LIFAGKQLEDGR,ub,K,276,false,"upl3 mutant / wildtype",168,35926874,"MaxQuant score",146.1600000,1.0000000,-0.2653446,0.4625600,NO,6.3510802172928E-10,-1.3821000
QLEDGRTLADYNIQKESTLHLVLR,ub,K,291,false,"Ubiquitination Membrane Proteins",120,33585938,,,,,,,,
TLADYNIQKESTLHLVLR,ub,K,291,false,"TAP 6xHis-tag Ub",1,19292762,XCorr,2.8400000,,,,,,
TLADYNIQKESTLHLVLR,ub,K,291,false,"MudPIT plant ubiquitination",103,17272265,XCorr,5.3000000,,,,,,
TLADYNIQKESTLHLVLR,ub,K,291,false,"Ubiquitination Membrane Proteins",120,33585938,,,,,,,,
TLADYNIQKESTLHLVLR,ub,K,291,false,"upl3 mutant / wildtype",168,35926874,"MaxQuant score",366.9900000,1.0000000,-0.2042331,0.6076800,NO,0,-0.1877200
ESTLHLVLR,ph,S,293,false,"atm and atr DNA damage response",88,25561503,"MASCOT Score",27.0000000,0.9970000,,,,,1.4600000
ESTLHLVLR,ph,T,294,false,"Tissue atlas Arabidopsis - ProteomicsDB",114,32188942,"MaxQuant score",130.5300000,0.9963610,,,,0.00032401300268248,
