Peptide,PTM,ModifiedAA,ModifiedPosition,PeptideUniqueToGene,ExperimentDesc,ExpID,PubmedID,ScoreType,IdentScore,LocProb,Log2FChange,PQ-val,QuantSig,PEP,MassErrorPPM
AFSPDSKK,ph,S,16,false,"atm and atr DNA damage response",88,25561503,"MASCOT Score",37.0000000,1.0000000,,,,,-2.5100000
KAFSPDSK,ph,S,16,false,"atm and atr DNA damage response",88,25561503,"MASCOT Score",30.0000000,0.9370000,,,,,-3.4800000
LAEGQNGVISNPPVVDNVRQSSSSPPPALAPR,ph,S,46,true,"TOR Kinase and ABA Receptor",100,29290610,XCorr,5.0550752,0.9125000,,,,0.00012379999679979,
QSSSSPPPALAPR,ph,S,46,true,"atm and atr DNA damage response",88,25561503,"MASCOT Score",48.0000000,0.9650000,,,,,-0.0100000
QSSSSPPPALAPR,ph,S,46,true,"Tissue atlas Arabidopsis - ProteomicsDB",114,32188942,"MaxQuant score",252.7200000,0.9978260,,,,0,
QSSSSPPPALAPR,ph,S,47,true,"atm and atr DNA damage response",88,25561503,"MASCOT Score",48.0000000,0.9650000,,,,,-0.0100000
QSSSSPPPALAPR,ph,S,47,true,"Tissue atlas Arabidopsis - ProteomicsDB",114,32188942,"MaxQuant score",252.7200000,0.9914550,,,,0,
QSSSSPPPALAPR,ph,S,48,true,"Large-scale phosphorylation discovery",44,23111157,XCorr,2.3830000,,,,,,
QSSSSPPPALAPR,ph,S,48,true,"atm and atr DNA damage response",88,25561503,"MASCOT Score",40.0000000,0.9790000,,,,,0.2200000
QSSSSPPPALAPR,ph,S,48,true,"Tissue atlas Arabidopsis - ProteomicsDB",114,32188942,"MaxQuant score",210.7300000,0.9237220,,,,0,
QSSSSPPPALAPR,ph,S,49,true,"STN8 phosphoproteome",38,21768351,"MASCOT Score",46.4100000,,,,,,-0.4669670
QSSSSPPPALAPR,ph,S,49,true,"Large-scale phosphorylation discovery",44,23111157,XCorr,3.1040000,,,,,,
QSSSSPPPALAPR,ph,S,49,true,"Phosphoproteome ethylene-regulated time response",46,24043427,"MASCOT Score",72.2500000,,,,,,-4.8663000
QSSSSPPPALAPR,ph,S,49,true,"Chloroplast kinase substrates",60,19376835,"MASCOT Score",45.8600000,,,,,,-1.2956700
QSSSSPPPALAPR,ph,S,49,true,"srk2dei ABA signaling phopshoproteomics",83,23572148,"MASCOT Score",44.0000000,,,,,,-0.0007000
QSSSSPPPALAPR,ph,S,49,true,"LAXIC - ABA stress",84a,23660473,XCorr,2.7900000,0.8800000,,,,0.016644399613142,
QSSSSPPPALAPR,ph,S,49,true,"LAXIC - mannitol vs control",84b,23660473,XCorr,2.4600000,0.9050000,,,,0.01797859929502,
QSSSSPPPALAPR,ph,S,49,true,"SnRK2 protein kinase substrates",85,23776212,XCorr,2.4320433,0.9860000,,,,0.0097042601555586,
QSSSSPPPALAPR,ph,S,49,true,"atm and atr DNA damage response",88,25561503,"MASCOT Score",47.0000000,0.9380000,,,,,-1.6000000
QSSSSPPPALAPR,ph,S,49,true,"Phospho cell culture sucrose/TOR",109,30833711,,,0.9737960,,,,,
QSSSSPPPALAPR,ph,S,49,true,"Tissue atlas Arabidopsis - ProteomicsDB",114,32188942,"MaxQuant score",219.3800000,0.9989900,,,,0,
DLSPPSTADAVNVTATDVPVVPSSSAPGVVR,nt,D,71,true,"HUNTER N-terminome: legumain, GluC and trypsin",119,31951383,"MaxQuant score",47.7570000,,,,,,
NRDLSPPSTADAVNVTATDVPVVPSSSAPGVVR,ph,S,73,true,"MAPK Arabidopsis substrates",45,23172892,"MaxQuant Score",100.9500000,,,,,,
NRDLSPPSTADAVNVTATDVPVVPSSSAPGVVR,ph,S,73,true,"TOR Kinase and ABA Receptor",100,29290610,XCorr,5.2232494,0.9765000,,,,8.7780001933879E-8,
NRDLSPPSTADAVNVTATDVPVVPSSSAPGVVR,ph,S,73,true,"Tissue atlas Arabidopsis - ProteomicsDB",114,32188942,"MaxQuant score",161.7500000,0.7730770,,,,0,
NRDLSPPSTADAVNVTATDVPVVPSSSAPGVVR,ph,S,76,true,"PAMP-triggered phosphorylation",48,24601666,"MASCOT Score",26.2300000,,,,,,
SNEEAAAILIQTIFR,ph,S,112,true,"TOR Kinase and ABA Receptor",100,29290610,XCorr,5.0624375,1.0000000,,,,2.7180000472526E-8,
LLMEGSVVKR,ph,S,150,true,"atm and atr DNA damage response",88,25561503,"MASCOT Score",20.0000000,1.0000000,,,,,-1.1200000
LLMEGSVVKR,ph,S,150,true,"Tissue atlas Arabidopsis - ProteomicsDB",114,32188942,"MaxQuant score",82.7050000,1.0000000,,,,0.00046725801075809,
ALAYSYSHQQNWK,ph,S,241,true,"TOR Kinase and ABA Receptor",100,29290610,XCorr,4.5080676,0.7936000,,,,5.0710001232801E-5,
ALAYSYSHQQNWK,ph,S,241,true,"Tissue atlas Arabidopsis - ProteomicsDB",114,32188942,"MaxQuant score",285.5800000,1.0000000,,,,0,
WMAGRPLESSEKEQSNSNNDNAASVK,ph,S,289,true,"Tissue atlas Arabidopsis - ProteomicsDB",114,32188942,"MaxQuant score",125.1100000,0.9429690,,,,1.3563799725398E-34,
EQSNSNNDNAASVKGSINRNEAAK,ph,S,289,true,"TOR Kinase and ABA Receptor",100,29290610,XCorr,3.9378450,0.9695000,,,,0.0010610000463203,
EQSNSNNDNAASVK,ph,S,289,true,"atm and atr DNA damage response",88,25561503,"MASCOT Score",30.0000000,0.9980000,,,,,0.3400000
WMAGRPLESSEKEQSNSNNDNAASVK,ph,S,296,true,"Tissue atlas Arabidopsis - ProteomicsDB",114,32188942,"MaxQuant score",170.4500000,1.0000000,,,,0,
EQSNSNNDNAASVKGSINR,ph,S,296,true,"atm and atr DNA damage response",88,25561503,"MASCOT Score",43.0000000,1.0000000,,,,,-1.4300000
EQSNSNNDNAASVK,ph,S,296,true,"atm and atr DNA damage response",88,25561503,"MASCOT Score",93.0000000,1.0000000,,,,,0.2400000
EQSNSNNDNAASVKGSINRNEAAK,ph,S,300,true,"TOR Kinase and ABA Receptor",100,29290610,XCorr,3.9378450,0.9998000,,,,0.0010610000463203,
EQSNSNNDNAASVKGSINRNEAAK,ph,S,300,true,"Tissue atlas Arabidopsis - ProteomicsDB",114,32188942,"MaxQuant score",110.2500000,1.0000000,,,,3.4709399192552E-21,
EQSNSNNDNAASVKGSINR,ph,S,300,true,"atm and atr DNA damage response",88,25561503,"MASCOT Score",43.0000000,1.0000000,,,,,-1.4300000
NGSTQPNTPSSAR,ph,S,315,true,"atm and atr DNA damage response",88,25561503,"MASCOT Score",60.0000000,0.8640000,,,,,-0.3700000
NGSTQPNTPSSAR,ph,S,315,true,"Tissue atlas Arabidopsis - ProteomicsDB",114,32188942,"MaxQuant score",168.0000000,0.9920000,,,,6.1675700320279E-15,
NGSTQPNTPSSAR,ph,T,316,true,"atm and atr DNA damage response",88,25561503,"MASCOT Score",41.0000000,0.9930000,,,,,-0.7100000
NGSTQPNTPSSAR,ph,T,316,true,"Tissue atlas Arabidopsis - ProteomicsDB",114,32188942,"MaxQuant score",109.0700000,0.9793000,,,,0.00010272600047756,
NGSTQPNTPSSAR,ph,T,320,true,"atm and atr DNA damage response",88,25561503,"MASCOT Score",57.0000000,0.9000000,,,,,0.0300000
NGSTQPNTPSSAR,ph,T,320,true,"Tissue atlas Arabidopsis - ProteomicsDB",114,32188942,"MaxQuant score",153.0000000,0.9918040,,,,1.334919952356E-9,
NGSTQPNTPSSAR,ph,S,322,true,"atm and atr DNA damage response",88,25561503,"MASCOT Score",45.0000000,0.9900000,,,,,-0.6500000
NGSTQPNTPSSAR,ph,S,323,true,"atm and atr DNA damage response",88,25561503,"MASCOT Score",45.0000000,1.0000000,,,,,-0.6500000
NGSTQPNTPSSARGTPR,ph,T,327,true,"Tissue atlas Arabidopsis - ProteomicsDB",114,32188942,"MaxQuant score",73.6750000,0.8082920,,,,0.0015870099887252,
NSFFSPPTPSR,ph,S,336,true,"srk2dei ABA signaling phopshoproteomics",83,23572148,"MASCOT Score",33.0000000,,,,,,-0.0001000
NSFFSPPTPSR,ph,S,336,true,"atm and atr DNA damage response",88,25561503,"MASCOT Score",43.0000000,1.0000000,,,,,0.3200000
NSFFSPPTPSR,ph,S,336,true,"Tissue atlas Arabidopsis - ProteomicsDB",114,32188942,"MaxQuant score",147.6600000,0.9999960,,,,2.8709399302329E-8,
NSFFSPPTPSR,ph,S,336,true,"Touch-induced phosphorylation: 40s touch vs untouc",136,30291188,"MASCOT score",53.7100000,,-0.0293331,0.8049565,NO,,4.7001571
NKNSFFSPPTPSR,ph,T,339,true,"Phosphoproteome ethylene-regulated time response",46,24043427,"MASCOT Score",61.5100000,,,,,,0.2839300
NSFFSPPTPSR,ph,T,339,true,"Large-scale phosphorylation discovery",44,23111157,XCorr,3.0940000,,,,,,
NSFFSPPTPSR,ph,T,339,true,"MAPK Arabidopsis substrates",45,23172892,"MaxQuant Score",64.4390000,,,,,,
NSFFSPPTPSR,ph,T,339,true,"Phosphoproteome ethylene-regulated time response",46,24043427,"MASCOT Score",57.4000000,,,,,,4.8068000
NSFFSPPTPSR,ph,T,339,true,"Chloroplast kinase substrates",60,19376835,"MASCOT Score",38.2400000,,,,,,-0.1444950
NSFFSPPTPSR,ph,T,339,true,"srk2dei ABA signaling phopshoproteomics",83,23572148,"MASCOT Score",54.0000000,,,,,,0.0007000
NSFFSPPTPSR,ph,T,339,true,"SnRK2 protein kinase substrates",85,23776212,XCorr,2.1696413,0.9780000,,,,0.00017816800391302,
NSFFSPPTPSR,ph,T,339,true,"atm and atr DNA damage response",88,25561503,"MASCOT Score",54.0000000,0.9470000,,,,,-0.1500000
NSFFSPPTPSR,ph,T,339,true,"TOR Kinase and ABA Receptor",100,29290610,XCorr,3.5103171,0.9947000,,,,0.0013320000143722,
NSFFSPPTPSR,ph,T,339,true,"Lateral root-induction - NAA vs control",106,23328941,"MASCOT Score",21.0000000,,,,,,
NSFFSPPTPSR,ph,T,339,true,"Phospho cell culture sucrose/TOR",109,30833711,,,0.8966480,,,,,
NSFFSPPTPSR,ph,T,339,true,"Col-0 callus - FC Col-0 vs. Col-0 Xray",111a,31410901,,41.9000000,,0.4515208,0.0000000,NO,,0.3079981
NSFFSPPTPSR,ph,T,339,true,"Col-0 X-ray callus - FC Col-0 vs. Col-0 Xray",111b,31410901,,41.9000000,,0.4515208,0.0000000,NO,,0.3079981
NSFFSPPTPSR,ph,T,339,true,"atm callus - FC atm vs. atm Xray",111c,31410901,,41.9000000,,-0.1934493,0.0000000,NO,,0.3079981
NSFFSPPTPSR,ph,T,339,true,"atm-3 X-ray callus - FC atm vs. atm Xray",111d,31410901,,41.9000000,,-0.1934493,0.0000000,NO,,0.3079981
NSFFSPPTPSR,ph,T,339,true,"Tissue atlas Arabidopsis - ProteomicsDB",114,32188942,"MaxQuant score",205.3100000,0.9372950,,,,5.0170200675604E-24,
NSFFSPPTPSR,ph,T,339,true,"Touch-induced phosphorylation: 40s touch vs untouc",136,30291188,"MASCOT score",65.7500000,,-0.7733419,0.2614487,NO,,3.9400244
NSFFSPPTPSR,ph,S,341,true,"Chloroplast kinase substrates",60,19376835,"MASCOT Score",38.3700000,,,,,,-0.6454150
NSFFSPPTPSR,ph,S,341,true,"srk2dei ABA signaling phopshoproteomics",83,23572148,"MASCOT Score",40.0000000,,,,,,-0.0007000
NSFFSPPTPSR,ph,S,341,true,"Tissue atlas Arabidopsis - ProteomicsDB",114,32188942,"MaxQuant score",198.5200000,0.9450780,,,,8.2735199403619E-19,
KSNDDDSKSTISVLSER,ph,S,350,true,"Tissue atlas Arabidopsis - ProteomicsDB",114,32188942,"MaxQuant score",64.5450000,0.9926150,,,,0.00022488899412565,
KSNDDDSKSTISVLSER,ph,S,355,true,"Tissue atlas Arabidopsis - ProteomicsDB",114,32188942,"MaxQuant score",217.5400000,0.9636550,,,,0,
KSNDDDSKSTISVLSER,ph,S,357,true,"Tissue atlas Arabidopsis - ProteomicsDB",114,32188942,"MaxQuant score",189.0700000,0.9968020,,,,2.8431800353169E-30,
STISVLSER,ph,S,357,true,"srk2dei ABA signaling phopshoproteomics",83,23572148,"MASCOT Score",32.0000000,,,,,,-0.0003000
KSNDDDSKSTISVLSER,ph,T,358,true,"Chloroplast kinase substrates",60,19376835,"MASCOT Score",34.8600000,,,,,,0.4567530
KSNDDDSKSTISVLSER,ph,T,358,true,"Tissue atlas Arabidopsis - ProteomicsDB",114,32188942,"MaxQuant score",149.1800000,0.8075210,,,,8.8988703558779E-12,
SNDDDSKSTISVLSER,ph,T,358,true,"srk2dei ABA signaling phopshoproteomics",83,23572148,"MASCOT Score",28.0000000,,,,,,-0.0008000
SNDDDSKSTISVLSER,ph,T,358,true,"TOR Kinase and ABA Receptor",100,29290610,XCorr,5.9612393,0.9282000,,,,1.3900000340072E-5,
STISVLSER,ph,T,358,true,"srk2dei ABA signaling phopshoproteomics",83,23572148,"MASCOT Score",30.0000000,,,,,,-0.0001000
KSNDDDSKSTISVLSER,ph,S,360,true,"Large-scale phosphorylation discovery",44,23111157,XCorr,3.2720000,,,,,,
KSNDDDSKSTISVLSER,ph,S,360,true,"Chloroplast kinase substrates",60,19376835,"MASCOT Score",34.8600000,,,,,,0.4567530
SNDDDSKSTISVLSER,ph,S,360,true,"srk2dei ABA signaling phopshoproteomics",83,23572148,"MASCOT Score",28.0000000,,,,,,-0.0008000
SNDDDSKSTISVLSER,ph,S,360,true,"TOR Kinase and ABA Receptor",100,29290610,XCorr,5.9612393,0.9999000,,,,1.3900000340072E-5,
STISVLSER,ph,S,360,true,"srk2dei ABA signaling phopshoproteomics",83,23572148,"MASCOT Score",43.0000000,,,,,,0.0001000
STISVLSER,ph,S,360,true,"atm and atr DNA damage response",88,25561503,"MASCOT Score",44.0000000,1.0000000,,,,,1.2000000
STISVLSER,ph,S,360,true,"TOR Kinase and ABA Receptor",100,29290610,XCorr,3.2673604,0.9773000,,,,0.0084659997373819,
STISVLSER,ph,S,360,true,"Phospho cell culture sucrose/TOR",109,30833711,,,0.9986750,,,,,
STISVLSER,ph,S,360,true,"Col-0 callus - FC Col-0 vs. Col-0 Xray",111a,31410901,,21.3700000,,1.7139562,0.0000000,NO,,0.2909627
STISVLSER,ph,S,360,true,"Col-0 X-ray callus - FC Col-0 vs. Col-0 Xray",111b,31410901,,21.3700000,,1.7139562,0.0000000,NO,,0.2909627
STISVLSER,ph,S,360,true,"atm callus - FC atm vs. atm Xray",111c,31410901,,21.3700000,,-3.2147938,0.0000000,NO,,0.2909627
STISVLSER,ph,S,360,true,"atm-3 X-ray callus - FC atm vs. atm Xray",111d,31410901,,21.3700000,,-3.2147938,0.0000000,NO,,0.2909627
STISVLSER,ph,S,360,true,"Tissue atlas Arabidopsis - ProteomicsDB",114,32188942,"MaxQuant score",217.5400000,0.9999920,,,,0,
KSNDDDSKSTISVLSER,ph,S,363,true,"Chloroplast kinase substrates",60,19376835,"MASCOT Score",35.8000000,,,,,,-0.1568670
SNDDDSKSTISVLSER,ph,S,363,true,"srk2dei ABA signaling phopshoproteomics",83,23572148,"MASCOT Score",28.0000000,,,,,,-0.0008000
SNDDDSKSTISVLSER,ph,S,363,true,"TOR Kinase and ABA Receptor",100,29290610,XCorr,5.9612393,1.0000000,,,,1.3900000340072E-5,
STISVLSER,ph,S,363,true,"STN8 phosphoproteome",38,21768351,"MASCOT Score",54.0900000,,,,,,0.2774950
STISVLSER,ph,S,363,true,"Chloroplast kinase substrates",60,19376835,"MASCOT Score",72.6500000,,,,,,-1.4008000
STISVLSER,ph,S,363,true,"srk2dei ABA signaling phopshoproteomics",83,23572148,"MASCOT Score",54.0000000,,,,,,-0.0012000
STISVLSER,ph,S,363,true,"SnRK2 protein kinase substrates",85,23776212,XCorr,2.7084885,1.0000000,,,,0.0040004798211157,
STISVLSER,ph,S,363,true,"atm and atr DNA damage response",88,25561503,"MASCOT Score",52.0000000,1.0000000,,,,,0.0900000
STISVLSER,ph,S,363,true,"TOR Kinase and ABA Receptor",100,29290610,XCorr,3.8537676,0.9967000,,,,8.63599962031E-6,
STISVLSER,ph,S,363,true,"Phospho cell culture sucrose/TOR",109,30833711,,,0.9999950,,,,,
STISVLSER,ph,S,363,true,"Col-0 callus - FC Col-0 vs. Col-0 Xray",111a,31410901,,21.3700000,,1.7139562,0.0000000,NO,,0.2909627
STISVLSER,ph,S,363,true,"Col-0 X-ray callus - FC Col-0 vs. Col-0 Xray",111b,31410901,,21.3700000,,1.7139562,0.0000000,NO,,0.2909627
STISVLSER,ph,S,363,true,"atm callus - FC atm vs. atm Xray",111c,31410901,,21.3700000,,-3.2147938,0.0000000,NO,,0.2909627
STISVLSER,ph,S,363,true,"atm-3 X-ray callus - FC atm vs. atm Xray",111d,31410901,,21.3700000,,-3.2147938,0.0000000,NO,,0.2909627
STISVLSER,ph,S,363,true,"Tissue atlas Arabidopsis - ProteomicsDB",114,32188942,"MaxQuant score",217.5400000,1.0000000,,,,0,
RHSIAGSSVRDDESLAGSPALPSYMVPTK,ph,S,370,true,"TOR Kinase and ABA Receptor",100,29290610,XCorr,3.8384571,0.9985000,,,,4.2410001697135E-6,
RHSIAGSSVR,ph,S,370,true,"TOR Kinase and ABA Receptor",100,29290610,XCorr,3.2493663,1.0000000,,,,4.0039998566499E-5,
RHSIAGSSVR,ph,S,370,true,"Tissue atlas Arabidopsis - ProteomicsDB",114,32188942,"MaxQuant score",126.1400000,0.9999970,,,,6.7822845673321E-43,
RHSIAGSSVRDDESLAGSPALPSYMVPTK,ph,S,374,true,"Large-scale phosphorylation discovery",44,23111157,XCorr,4.3120000,,,,,,
RHSIAGSSVRDDESLAGSPALPSYMVPTK,ph,S,381,true,"Large-scale phosphorylation discovery",44,23111157,XCorr,4.5760000,,,,,,
HSIAGSSVRDDESLAGSPALPSYMVPTK,ph,S,381,true,"Large-scale phosphorylation discovery",44,23111157,XCorr,5.4190000,,,,,,
HSIAGSSVRDDESLAGSPALPSYMVPTK,ph,S,381,true,"MAPK Arabidopsis substrates",45,23172892,"MaxQuant Score",131.9400000,,,,,,
HSIAGSSVRDDESLAGSPALPSYMVPTK,ph,S,381,true,"TOR Kinase and ABA Receptor",100,29290610,XCorr,4.9047227,0.9980000,,,,6.1840000853408E-5,
DDESLAGSPALPSYMVPTK,ph,S,381,true,"STN8 phosphoproteome",38,21768351,"MASCOT Score",63.4500000,,,,,,
DDESLAGSPALPSYMVPTK,ph,S,381,true,"TOR Kinase and ABA Receptor",100,29290610,XCorr,3.5229611,0.9953000,,,,0.0012169999536127,
DDESLAGSPALPSYMVPTK,ph,S,381,true,"Tissue atlas Arabidopsis - ProteomicsDB",114,32188942,"MaxQuant score",319.7200000,1.0000000,,,,0,
DDESLAGSPALPSYMVPTK,ph,S,381,true,"Touch-induced phosphorylation: 40s touch vs untouc",136,30291188,"MASCOT score",64.1000000,,-0.1097878,0.7084524,NO,,2.8231654
RHSIAGSSVRDDESLAGSPALPSYMVPTK,ph,S,385,true,"Large-scale phosphorylation discovery",44,23111157,XCorr,5.5500000,,,,,,
DDESLAGSPALPSYMVPTK,ph,S,385,true,"Tissue atlas Arabidopsis - ProteomicsDB",114,32188942,"MaxQuant score",211.1600000,1.0000000,,,,0,
DDESLAGSPALPSYMVPTKSAR,ub,K,396,true,"Arabidopsis ubiquitination COFRADIC",40,26744219,"MaxQuant Score",48.0530000,1.0000000,,,,0.0001438000035705,0.0980000
LKPQSPLGGTTQENEGFTDKASAK,ph,S,406,true,"STN8 phosphoproteome",38,21768351,"MASCOT Score",75.7100000,,,,,,-0.8432750
LKPQSPLGGTTQENEGFTDKASAK,ph,S,406,true,"Chloroplast kinase substrates",60,19376835,"MASCOT Score",68.4100000,,,,,,-0.8432750
LKPQSPLGGTTQENEGFTDK,ph,S,406,true,"Mitochondrial phosphoproteome",32,19688752,"MASCOT Score",45.0900000,,,,,,10.2690000
LKPQSPLGGTTQENEGFTDK,ph,S,406,true,"STN8 phosphoproteome",38,21768351,"MASCOT Score",91.5300000,,,,,,-0.8478590
LKPQSPLGGTTQENEGFTDK,ph,S,406,true,"PAMP-triggered phosphorylation",48,24601666,"MASCOT Score",26.9000000,,,,,,
LKPQSPLGGTTQENEGFTDK,ph,S,406,true,"Chloroplast kinase substrates",60,19376835,"MASCOT Score",76.6000000,,,,,,-0.8344000
LKPQSPLGGTTQENEGFTDK,ph,S,406,true,"srk2dei ABA signaling phopshoproteomics",83,23572148,"MASCOT Score",92.0000000,,,,,,0.0000000
LKPQSPLGGTTQENEGFTDK,ph,S,406,true,"LAXIC - ABA stress",84a,23660473,XCorr,4.0300000,1.0000000,,,,0.00025928899412975,
LKPQSPLGGTTQENEGFTDK,ph,S,406,true,"LAXIC - mannitol vs control",84b,23660473,XCorr,4.2000000,1.0000000,-1.0168712,,NO,0.00020709699310828,
LKPQSPLGGTTQENEGFTDK,ph,S,406,true,"SnRK2 protein kinase substrates",85,23776212,XCorr,3.7998595,1.0000000,,,,0.0028541800566018,
LKPQSPLGGTTQENEGFTDK,ph,S,406,true,"atm and atr DNA damage response",88,25561503,"MASCOT Score",76.0000000,1.0000000,,,,,1.0200000
LKPQSPLGGTTQENEGFTDK,ph,S,406,true,"Protein sumoylation and phosphorylation cross-talk",97,28419593,,,,,,,,
LKPQSPLGGTTQENEGFTDK,ph,S,406,true,"TOR Kinase and ABA Receptor",100,29290610,XCorr,4.0784855,1.0000000,,,,1.1899999918796E-7,
LKPQSPLGGTTQENEGFTDK,ph,S,406,true,"Lateral root-induction - NAA vs control",106,23328941,"MASCOT Score",47.0000000,,,,,,
LKPQSPLGGTTQENEGFTDK,ph,S,406,true,"Phospho cell culture sucrose/TOR",109,30833711,,,0.9998480,,,,,
LKPQSPLGGTTQENEGFTDK,ph,S,406,true,"Col-0 callus - FC Col-0 vs. Col-0 Xray",111a,31410901,,61.9700000,,0.7217015,0.0000000,NO,,1.5692072
LKPQSPLGGTTQENEGFTDK,ph,S,406,true,"Col-0 X-ray callus - FC Col-0 vs. Col-0 Xray",111b,31410901,,61.9700000,,0.7217015,0.0000000,NO,,1.5692072
LKPQSPLGGTTQENEGFTDK,ph,S,406,true,"atm callus - FC atm vs. atm Xray",111c,31410901,,61.9700000,,0.8796527,0.0000000,NO,,1.5692072
LKPQSPLGGTTQENEGFTDK,ph,S,406,true,"atm-3 X-ray callus - FC atm vs. atm Xray",111d,31410901,,61.9700000,,0.8796527,0.0000000,NO,,1.5692072
LKPQSPLGGTTQENEGFTDK,ph,S,406,true,"Tissue atlas Arabidopsis - ProteomicsDB",114,32188942,"MaxQuant score",256.4000000,1.0000000,,,,0,
LKPQSPLGGTTQENEGFTDK,ph,S,406,true,"Touch-induced phosphorylation: 40s touch vs untouc",136,30291188,"MASCOT score",138.6800000,,-0.0896266,0.1600965,NO,,1.9957549
LKPQSPLGGTTQENEGFTDK,ph,T,411,true,"srk2dei ABA signaling phopshoproteomics",83,23572148,"MASCOT Score",50.0000000,,,,,,-0.0018000
LKPQSPLGGTTQENEGFTDK,ph,T,411,true,"Lateral root-induction - NAA vs control",106,23328941,"MASCOT Score",52.0000000,,,,,,
LKPQSPLGGTTQENEGFTDKASAK,ph,S,423,true,"Tissue atlas Arabidopsis - ProteomicsDB",114,32188942,"MaxQuant score",74.4400000,0.9740390,,,,8.8688700827788E-9,
RLSYPTSPALPKPR,ph,S,429,true,"atm and atr DNA damage response",88,25561503,"MASCOT Score",33.0000000,0.9950000,,,,,0.3600000
LSYPTSPALPKPR,ph,S,429,true,"atm and atr DNA damage response",88,25561503,"MASCOT Score",24.0000000,0.9810000,,,,,0.1200000
RLSYPTSPALPK,ph,S,429,true,"atm and atr DNA damage response",88,25561503,"MASCOT Score",24.0000000,1.0000000,,,,,0.2600000
RLSYPTSPALPK,ph,S,429,true,"Brassinosteroid-Regulated Phosphorylation Dynamics",94,26187819,"MaxQuant Score",81.8540000,0.9960000,,,,0.0089999996125698,-5.5650000
RLSYPTSPALPKPR,ph,T,432,true,"atm and atr DNA damage response",88,25561503,"MASCOT Score",28.0000000,0.9950000,,,,,0.6100000
LSYPTSPALPKPR,ph,T,432,true,"Large-scale phosphorylation discovery",44,23111157,XCorr,2.9950000,,,,,,
LSYPTSPALPKPR,ph,T,432,true,"MAPK Arabidopsis substrates",45,23172892,"MaxQuant Score",87.4980000,,,,,,
LSYPTSPALPKPR,ph,T,432,true,"Phosphoproteome ethylene-regulated time response",46,24043427,"MASCOT Score",50.0500000,,,,,,3.8214000
RLSYPTSPALPK,ph,T,432,true,"atm and atr DNA damage response",88,25561503,"MASCOT Score",24.0000000,0.9940000,,,,,0.2600000
RLSYPTSPALPKPR,ph,S,433,true,"Phosphoproteome ethylene-regulated time response",46,24043427,"MASCOT Score",38.6100000,,,,,,-17.0679000
RLSYPTSPALPKPR,ph,S,433,true,"atm and atr DNA damage response",88,25561503,"MASCOT Score",33.0000000,0.9390000,,,,,0.3600000
LSYPTSPALPKPR,ph,S,433,true,"STN8 phosphoproteome",38,21768351,"MASCOT Score",43.4600000,,,,,,-1.0959000
LSYPTSPALPKPR,ph,S,433,true,"MAPK Arabidopsis substrates",45,23172892,"MaxQuant Score",100.2200000,,,,,,
LSYPTSPALPKPR,ph,S,433,true,"Phosphoproteome ethylene-regulated time response",46,24043427,"MASCOT Score",43.8500000,,,,,,-13.4580000
LSYPTSPALPKPR,ph,S,433,true,"Chloroplast kinase substrates",60,19376835,"MASCOT Score",72.6800000,,,,,,-0.8306140
LSYPTSPALPKPR,ph,S,433,true,"atm and atr DNA damage response",88,25561503,"MASCOT Score",32.0000000,0.9940000,,,,,0.3800000
LSYPTSPALPKPR,ph,S,433,true,"Phospho cell culture sucrose/TOR",109,30833711,,,0.9138370,,,,,
LSYPTSPALPKPR,ph,S,433,true,"Tissue atlas Arabidopsis - ProteomicsDB",114,32188942,"MaxQuant score",245.5500000,0.9998830,,,,0,
LSYPTSPALPK,ph,S,433,true,"atm and atr DNA damage response",88,25561503,"MASCOT Score",29.0000000,0.9540000,,,,,0.2700000
RFSAPPKVESGGVTVTNGAGS,ph,S,443,true,"Tissue atlas Arabidopsis - ProteomicsDB",114,32188942,"MaxQuant score",271.8700000,1.0000000,,,,0,
RFSAPPK,ph,S,443,true,"TOR Kinase and ABA Receptor",100,29290610,XCorr,2.8135531,1.0000000,,,,0.036439999938011,
VESGGVTVTNGAGS,ph,S,450,true,"atm and atr DNA damage response",88,25561503,"MASCOT Score",34.0000000,0.8160000,,,,,0.1000000
VESGGVTVTNGAGS,ph,S,461,true,"atm and atr DNA damage response",88,25561503,"MASCOT Score",66.0000000,0.9370000,,,,,0.3500000
