Peptide,PTM,ModifiedAA,ModifiedPosition,PeptideUniqueToGene,ExperimentDesc,ExpID,PubmedID,ScoreType,IdentScore,LocProb,Log2FChange,PQ-val,QuantSig,PEP,MassErrorPPM
KAVDVDDSPRAVSLWDR,ph,S,270,true,"Tissue atlas Arabidopsis - ProteomicsDB",114,32188942,"MaxQuant score",191.8400000,1.0000000,,,,1.0921100043184E-13,
KAVDVDDSPR,ph,S,270,true,"atm and atr DNA damage response",88,25561503,"MASCOT Score",48.0000000,1.0000000,,,,,0.8600000
KAVDVDDSPR,ph,S,270,true,"Phospho cell culture sucrose/TOR",109,30833711,,,1.0000000,,,,,
AVDVDDSPR,ph,S,270,true,"atm and atr DNA damage response",88,25561503,"MASCOT Score",49.0000000,1.0000000,,,,,0.8700000
VDSTCAQVVHSNPEFPSNQLVAPPAEK,ph,S,290,true,"Tissue atlas Arabidopsis - ProteomicsDB",114,32188942,"MaxQuant score",94.6740000,0.9155900,,,,5.4706198616125E-17,
GPLDLSSESPSSK,ph,S,375,true,"Tissue atlas Arabidopsis - ProteomicsDB",114,32188942,"MaxQuant score",109.0700000,0.8312340,,,,0.00014002200623509,
GPLDLSSESPSSK,ph,S,376,true,"Tissue atlas Arabidopsis - ProteomicsDB",114,32188942,"MaxQuant score",174.9500000,0.7735570,,,,1.7741000259914E-15,
GPLDLSSESPSSK,ph,S,378,true,"Tissue atlas Arabidopsis - ProteomicsDB",114,32188942,"MaxQuant score",201.0600000,0.9818810,,,,8.8974501599827E-32,
ISGGNLGSTSLQDNNSQDLIKK,ub,K,495,true,"Arabidopsis ubiquitination by TUBEs",2,23667124,,,,,,,,
