Peptide,PTM,ModifiedAA,ModifiedPosition,PeptideUniqueToGene,ExperimentDesc,ExpID,PubmedID,ScoreType,IdentScore,LocProb,Log2FChange,PQ-val,QuantSig,PEP,MassErrorPPM
SGGLDMSLDDIIKSNR,nt,S,2,true,"Arg/N-end rule seed, prt6 vs. Wt",99,29168982,"MASCOT Score",71.1800000,,,,,0.0011749999830499,-1.0509411
SGGLDMSLDDIIKSNR,nta,S,2,true,"Arg/N-end rule pathway Roots",80,25728785,"MASCOT Score",72.4600000,,,,,7.1450000405093E-7,
SGGLDMSLDDIIKSNR,nta,S,2,true,"Arg/N-end rule seed, prt6 vs. Wt",99,29168982,"MASCOT Score",71.1800000,,-0.1384943,0.4185369,NO,0.0011749999830499,-1.0509411
SGGLDMSLDDIIKSNR,nta,S,2,true,"FtsH12 N-terminome: WT / FtsH12 knockdown miRNA",118,33216923,"MaxQuant score",97.9570000,,,,,3.1700001272839E-5,
SGGLDMSLDDIIKSNR,nta,S,2,true,"HUNTER N-terminome: legumain, GluC and trypsin",119,31951383,"MaxQuant score",75.5740000,,,,,,
SGGLDMSLDDIIKSNR,nta,S,2,true,"Arabidopsis translation initiation landscape - NTA",167a,35069635,,,,,,,,
SGGLDMSLDDIIK,nta,S,2,true,"Characterization plant N-terminal acetylation",6,22223895,"MASCOT Score",78.6900000,,,,,,
SGGLDMSLD,nta,S,2,true,"HUNTER N-terminome: legumain, GluC and trypsin",119,31951383,"MaxQuant score",113.8900000,,,,,,
SGGLDMSLDDIIK,ph,S,2,true,"atm and atr DNA damage response",88,25561503,"MASCOT Score",77.0000000,1.0000000,,,,,-1.2200000
SGGLDMSLDDIIKSNR,ub,K,14,true,"Arabidopsis ubiquitination COFRADIC",40,26744219,"MaxQuant Score",64.5650000,1.0000000,,,,5.4330001830749E-7,0.1270000
TAVVGGGSSIE,nt,T,95,true,"Arg/N-end rule seed, prt6 vs. Wt",99,29168982,"MASCOT Score",73.4600000,,-0.3899302,0.0052463,NO,4.1429998418607E-6,-1.2440048
ELFSEVGDLKR,ac,K,135,true,"Quantitative Acetylproteomics",101,29440448,,,,,,,,
RGDALAAVKR,ac,K,166,true,"Quantitative Acetylproteomics",101,29440448,,,,,,,,
GDALAAVKR,ub,K,166,true,"Arabidopsis ubiquitination COFRADIC",40,26744219,"MaxQuant Score",96.6680000,1.0000000,,,,0.0040000001899898,0.6300000
GILGNFNE,nt,G,206,true,"Arg/N-end rule seed, prt6 vs. Wt",99,29168982,"MASCOT Score",38.2900000,,-0.2308254,0.6712845,NO,0.023250000551343,-0.3925223
DENVSAEDLDAELDKYHK,ph,S,273,true,"Tissue atlas Arabidopsis - ProteomicsDB",114,32188942,"MaxQuant score",219.8500000,1.0000000,,,,0,
DENVSAEDLDAELDK,ph,S,273,true,"atm and atr DNA damage response",88,25561503,"MASCOT Score",38.0000000,1.0000000,,,,,-0.1200000
DENVSAEDLDAELDK,ph,S,273,true,"Lateral root-induction - NAA vs control",106,23328941,"MASCOT Score",25.0000000,,,,,,
