Peptide,PTM,ModifiedAA,ModifiedPosition,PeptideUniqueToGene,ExperimentDesc,ExpID,PubmedID,ScoreType,IdentScore,LocProb,Log2FChange,PQ-val,QuantSig,PEP,MassErrorPPM
SGKGEGPAIGIDLGTTYSCVGVWQHDR,nt,S,2,true,"N-terminal ChaFRADIC",92,26010716,"MASCOT Score",77.7800000,,,,,1.653000047952E-8,
SGKGEGPAIGIDLGTTYSC,nt,S,2,true,"Arg/N-end rule seed, prt6 vs. Wt",99,29168982,"MASCOT Score",70.5400000,,,,,0.00072720000753179,-0.7083354
SGKGEGPAIGIDLGTTYS,nt,S,2,true,"Arg/N-end rule seed, prt6 vs. Wt",99,29168982,"MASCOT Score",39.0900000,,,,,0.045460000634193,-4.1317328
SGKGEGPAIGIDLGTTY,nt,S,2,true,"Stromal N-terminome",96,26371235,"MASCOT Score",85.8700000,,,,,,
SGKGEGPAIGIDLGTTY,nt,S,2,true,"Arg/N-end rule seed, prt6 vs. Wt",99,29168982,"MASCOT Score",58.0500000,,,,,0.0044370000250638,-9.6084054
SGKGEGPAIGIDLGTT,nt,S,2,true,"Arg/N-end rule seed, prt6 vs. Wt",99,29168982,"MASCOT Score",40.6800000,,,,,0.12800000607967,-1.9091439
SGKGEGPAIGIDL,nt,S,2,true,"N-terminal ChaFRADIC",92,26010716,"MASCOT Score",73.1400000,,,,,1.5870000424911E-8,
SGKGEGPAIGID,nt,S,2,true,"Arg/N-end rule seed, prt6 vs. Wt",99,29168982,"MASCOT Score",54.8200000,,,,,0.0018070000223815,-1.3795010
SGKGEGPAIGI,nt,S,2,true,"N-terminal ChaFRADIC",92,26010716,"MASCOT Score",40.9000000,,,,,0.031819999217987,
SGKGEGPAIG,nt,S,2,true,"N-term acetylation drought responses",5,26184543,,,,,,,,
SGKGEGPAIGIDLGTTYSCVGVWQHDRVE,nta,S,2,true,"Arabidopsis translation initiation landscape - NTA",167a,35069635,,,,,,,,
SGKGEGPAIGIDLGTTYSCVGVWQHDR,nta,S,2,true,"N-terminal ChaFRADIC",92,26010716,"MASCOT Score",77.7800000,,,,,1.653000047952E-8,
SGKGEGPAIGIDLGTTYSCVGVWQHDR,nta,S,2,true,"HUNTER N-terminome: legumain, GluC and trypsin",119,31951383,"MaxQuant score",134.0300000,,,,,,
SGKGEGPAIGIDLGTTYSC,nta,S,2,true,"Arg/N-end rule seed, prt6 vs. Wt",99,29168982,"MASCOT Score",70.5400000,,-0.1219042,0.5136678,NO,0.00072720000753179,-0.7083354
SGKGEGPAIGIDLGTTYS,nta,S,2,true,"Arg/N-end rule seed, prt6 vs. Wt",99,29168982,"MASCOT Score",39.0900000,,-0.3550418,0.2617067,NO,0.045460000634193,-4.1317328
SGKGEGPAIGIDLGTTY,nta,S,2,true,"Characterization plant N-terminal acetylation",6,22223895,"MASCOT Score",65.9100000,,,,,,
SGKGEGPAIGIDLGTTY,nta,S,2,true,"Arg/N-end rule pathway Roots",80,25728785,"MASCOT Score",71.4700000,,,,,3.023000090252E-6,
SGKGEGPAIGIDLGTTY,nta,S,2,true,"Stromal N-terminome",96,26371235,"MASCOT Score",85.8700000,,,,,,
SGKGEGPAIGIDLGTTY,nta,S,2,true,"Arg/N-end rule seed, prt6 vs. Wt",99,29168982,"MASCOT Score",58.0500000,,-0.2896737,0.0819245,NO,0.0044370000250638,-9.6084054
SGKGEGPAIGIDLGTT,nta,S,2,true,"Arg/N-end rule seed, prt6 vs. Wt",99,29168982,"MASCOT Score",40.6800000,,-0.0483436,0.9433113,NO,0.12800000607967,-1.9091439
SGKGEGPAIGIDL,nta,S,2,true,"N-terminal ChaFRADIC",92,26010716,"MASCOT Score",73.1400000,,,,,1.5870000424911E-8,
SGKGEGPAIGID,nta,S,2,true,"Arg/N-end rule seed, prt6 vs. Wt",99,29168982,"MASCOT Score",54.8200000,,-0.0394515,0.6856062,NO,0.0018070000223815,-1.3795010
SGKGEGPAIGI,nta,S,2,true,"N-terminal ChaFRADIC",92,26010716,"MASCOT Score",40.9000000,,,,,0.031819999217987,
SGKGEGPAIG,nta,S,2,true,"N-term acetylation drought responses",5,26184543,,,,,,,,
SGKGEGPAIGIDLGTTYSCVGVWQHDR,ph,S,2,true,"Tissue atlas Arabidopsis - ProteomicsDB",114,32188942,"MaxQuant score",271.1600000,1.0000000,,,,0,
VGVWQHDRVE,nt,V,21,false,"Arg/N-end rule seed, prt6 vs. Wt",99,29168982,"MASCOT Score",32.5700000,,,,,0.0009247999987565,-0.3050902
EIIANDQGNR,nt,E,30,false,"Metacaspase9 substrates - in vitro rMC9",51c,23964026,"MASCOT Score",84.0000000,,2.0127246,,NO,,0.0834311
TTPSYVAFTDSER,nt,T,40,false,"Stromal N-terminome",96,26371235,"MASCOT Score",76.5200000,,,,,,
TTPSYVAFTDSER,nt,T,40,false,"Arabidopsis translation initiation landscape - NT",167b,35069635,,,,,,,,
TTPSYVAFTDSER,ph,T,48,false,"Tissue atlas Arabidopsis - ProteomicsDB",114,32188942,"MaxQuant score",114.6900000,0.8119980,,,,0.00026443999377079,
LIGDAAKNQVAMNPVNTVFDAK,ac,K,59,false,"Histone deacetylases - apicidin vs control",98a,29061669,"MaxQuant Score",93.8000000,1.0000000,0.4310000,0.3908409,NO,1.199999995205E-11,
LIGDAAKNQVAMNPVNTVFDAK,ac,K,59,false,"Quantitative Acetylproteomics",101,29440448,,,,,,,,
NQVAMNPVNTVFDAK,mox,M,64,false,"cat2 Methionine oxidation - 1h stress",62a,25693801,"MASCOT Score",117.0000000,,0.0408707,,NO,,
NQVAMNPVNTVFDAKR,ac,K,74,false,"Quantitative Acetylproteomics",101,29440448,,,,,,,,
LIGDAAKNQVAMNPVNTVFDAKR,ub,K,74,false,"Arabidopsis ubiquitination COFRADIC",40,26744219,"MaxQuant Score",51.4310000,0.9440000,,,,0.0040000001899898,3.7720000
RFSDSSVQSDMK,ph,S,82,true,"atm and atr DNA damage response",88,25561503,"MASCOT Score",38.0000000,1.0000000,,,,,0.1500000
RFSDSSVQSDMK,ph,S,82,true,"TOR Kinase and ABA Receptor",100,29290610,XCorr,3.5548964,0.9931000,,,,0.00059259997215122,
RFSDSSVQSDMK,ph,S,82,true,"Phospho cell culture sucrose/TOR",109,30833711,,,0.9973990,,,,,
RFSDSSVQSDMK,ph,S,82,true,"Tissue atlas Arabidopsis - ProteomicsDB",114,32188942,"MaxQuant score",222.4200000,0.9998480,,,,6.0489290290124E-40,
FSDSSVQSDMK,ph,S,84,true,"Tyrosine phosphorylation in Arabidopsis",59,18463617,"MASCOT Score",40.0000000,,,,,,-1.0691199
FSDSSVQSDMK,ph,S,84,true,"atm and atr DNA damage response",88,25561503,"MASCOT Score",46.0000000,1.0000000,,,,,-0.6200000
FSDSSVQSDMK,ph,S,84,true,"Tissue atlas Arabidopsis - ProteomicsDB",114,32188942,"MaxQuant score",216.8300000,0.9903910,,,,2.5958200772867E-32,
FSDSSVQSDMK,ph,S,85,true,"Tissue atlas Arabidopsis - ProteomicsDB",114,32188942,"MaxQuant score",87.2410000,0.9098560,,,,0.00068541098153219,
FSDSSVQSDMK,ph,S,88,true,"Tissue atlas Arabidopsis - ProteomicsDB",114,32188942,"MaxQuant score",192.7100000,0.9999940,,,,2.5179200002282E-18,
VTIKNAVVTVPAYFNDSQRQATKD,nt,V,141,true,"Arabidopsis translation initiation landscape - NT",167b,35069635,,,,,,,,
AVVTVPAYFNDSQR,nt,A,146,false,"Arg/N-end rule seed, prt6 vs. Wt",99,29168982,"MASCOT Score",31.0500000,,,,,0.044799998402596,-1.4530936
QATKDAGVIAGLNVMR,nt,Q,160,false,"HUNTER N-terminome: legumain, GluC and trypsin",119,31951383,"MaxQuant score",93.4240000,,,,,,
QATKDAGVIAGLNVMR,cr,K,163,false,"Open search Plant PTM Viewer 2.0 - Crotonylation",164c,TBA,,,,,,,,
QATKDAGVIAGLNVMR,ub,K,163,false,"Arabidopsis ubiquitination COFRADIC",40,26744219,"MaxQuant Score",58.7230000,1.0000000,,,,1.3269999499244E-6,0.0210000
QATKDAGVIAGLNVMR,ub,K,163,false,"upl3 mutant / wildtype",168,35926874,"MaxQuant score",51.7710000,1.0000000,-0.9885044,,,0.0009823499713093,3.9999000
DAGVIAGLNVMR,nt,D,164,false,"Metacaspase9 substrates - in vitro rMC9",51c,23964026,"MASCOT Score",87.0000000,,,,,,0.0768828
IINEPTAAAIAY,nt,I,176,false,"Arg/N-end rule seed, prt6 vs. Wt",99,29168982,"MASCOT Score",62.7300000,,,,,0.022730000317097,-2.0862751
IINEPTAAAIAYGLDKK,ac,K,191,false,"Histone deacetylases - apicidin vs control",98a,29061669,"MaxQuant Score",104.2000000,1.0000000,0.3090000,0.1807174,NO,9.9999999981996E-24,
IINEPTAAAIAYGLDKK,ac,K,191,false,"Histone deacetylases- hda14 vs WT (low light)",98c,29061669,"MaxQuant Score",134.5200000,1.0000000,0.9660000,0.9885531,NO,2.600000016173E-6,
IINEPTAAAIAYGLDKK,ac,K,191,false,"Histone deacetylases substrates - hda14 vs WT",98e,29061669,"MaxQuant Score",71.6000000,1.0000000,0.0580000,0.9162205,NO,1.9999999949505E-6,
IINEPTAAAIAYGLDKK,ac,K,191,false,"Quantitative Acetylproteomics",101,29440448,,,,,,,,
IINEPTAAAIAYGLDKK,cr,K,191,false,"Open search Plant PTM Viewer 2.0 - Crotonylation",164c,TBA,,,,,,,,
IINEPTAAAIAYGLDKK,hib,K,191,false,"Open search Plant PTM Viewer 2.0 - hib",164e,TBA,,,,,,,,
IINEPTAAAIAYGLDKKATSVGEK,ub,K,191,false,"upl3 mutant / wildtype",168,35926874,"MaxQuant score",87.8020000,1.0000000,0.5430009,0.3085200,NO,1.5520299490035E-9,0.5213300
IINEPTAAAIAYGLDKKATSVGEK,ub,K,192,false,"upl3 mutant / wildtype",168,35926874,"MaxQuant score",87.8020000,1.0000000,0.5430009,0.3085200,NO,1.5520299490035E-9,0.5213300
KATSVGEK,ph,S,195,false,"atm and atr DNA damage response",88,25561503,"MASCOT Score",25.0000000,0.9420000,,,,,-0.6100000
ATAGDTHLGGEDFDNR,nt,A,227,false,"Arg/N-end rule seed, prt6 vs. Wt",99,29168982,"MASCOT Score",50.9300000,,,,,0.005816999822855,-1.5875702
ATAGDTHLGGEDFDNR,nt,A,227,false,"FtsH12 N-terminome: WT / FtsH12 knockdown miRNA",118,33216923,"MaxQuant score",64.8200000,,0.5988104,0.0120454,YES,0.0032337000593543,
ATAGDTHLGGEDFDNR,ph,T,232,false,"atm and atr DNA damage response",88,25561503,"MASCOT Score",33.0000000,1.0000000,,,,,0.0400000
ATAGDTHLGGEDFDNR,ph,T,232,false,"Tissue atlas Arabidopsis - ProteomicsDB",114,32188942,"MaxQuant score",59.5740000,0.9998890,,,,0.00044671801151708,
MVNHFVQEFKR,ac,K,252,false,"Histone deacetylases substrates - TSA vs control",98b,29061669,"MaxQuant Score",81.6000000,1.0000000,-0.2090000,0.9794900,NO,1.9999999949505E-6,
MVNHFVQEFKR,ac,K,252,false,"Histone deacetylases- hda14 vs WT (low light)",98c,29061669,"MaxQuant Score",52.0700000,1.0000000,0.4930000,0.9885531,NO,0.014999999664724,
MVNHFVQEFKR,ac,K,252,false,"Histone deacetylases substrates - hda14 vs WT",98e,29061669,"MaxQuant Score",67.4000000,1.0000000,-0.1650000,0.8790225,NO,0.00023999999393709,
MVNHFVQEFKR,ac,K,252,false,"Quantitative Acetylproteomics",101,29440448,,,,,,,,
MVNHFVQEFKR,ub,K,252,false,"Arabidopsis ubiquitination COFRADIC",40,26744219,"MaxQuant Score",45.6610000,1.0000000,,,,0.003000000026077,-0.2630000
MVNHFVQEFKR,ub,K,252,false,"upl3 mutant / wildtype",168,35926874,"MaxQuant score",170.5200000,1.0000000,0.1839628,0.5624200,NO,2.0560299990313E-11,-0.2965300
KSKKDITGNPR,ub,K,254,true,"Arabidopsis ubiquitination COFRADIC",40,26744219,"MaxQuant Score",74.9870000,0.9890000,,,,0.0040000001899898,0.4990000
KSKKDITGNPR,ub,K,256,true,"Arabidopsis ubiquitination COFRADIC",40,26744219,"MaxQuant Score",80.3180000,0.9890000,,,,0.00037930000689812,-0.4080000
STAQTTIE,nt,S,282,false,"Arg/N-end rule seed, prt6 vs. Wt",99,29168982,"MASCOT Score",49.3000000,,,,,0.02301000058651,-0.3769179
KCMEPVEK,ox,C,319,false,"OxiTRAQ Arabidopsis - 5 mM H2O2 versus control",47,24376095,,,,-0.2418918,0.0509546,NO,,
CMEPVEK,ox,C,319,false,"OxiTRAQ Arabidopsis - 5 mM H2O2 versus control",47,24376095,,,,-0.4087691,0.1487939,NO,,
CMEPVEK,ox,C,319,false,"SPEAR - 10 mM H2O2 / mock",138a,34619326,,,,3.1960979,0.0302195,YES,,
CMEPVEK,ox,C,319,false,"SPEAR - 50 mM H2O2 / mock",138b,34619326,,,,2.5061288,0.0071101,YES,,
CMEPVEK,sno,C,319,false,"Endogenous S-nitrosylation in Arabidopsis",64,22115780,"MASCOT Score",31.0000000,,,,,,
CMEPVEK,sno,C,319,false,"hot5-4 / wildtype, FAT-switch S-nitrosoproteome",169,37277371,,,,,,,,
KCMEPVEK,so,C,319,false,"S-sulfenylation site detection using YAP1C",110,32714340,,,,,,,,
CLRDAK,so,C,326,false,"S-sulfenylation site detection using YAP1C",110,32714340,,,,,,,,
MDKSTVHDVVLVGGSTR,ac,K,334,true,"Quantitative Acetylproteomics",101,29440448,,,,,,,,
DAKMDKSTVHDVVLVGGSTR,ub,K,334,true,"Arabidopsis ubiquitination COFRADIC",40,26744219,"MaxQuant Score",48.6160000,0.9790000,,,,0.00032150000333786,-0.3510000
VQQLLQDFFNGKELCK,cr,K,363,false,"Open search Plant PTM Viewer 2.0 - Crotonylation",164c,TBA,,,,,,,,
VQQLLQDFFNGKELCK,so,C,366,false,"S-sulfenylation site detection using YAP1C",110,32714340,,,,,,,,
GAAVQGAILSGE,nt,G,378,true,"Arg/N-end rule seed, prt6 vs. Wt",99,29168982,"MASCOT Score",44.9500000,,-0.2646108,0.6880097,NO,0.0016189999878407,-1.4599610
QGAILSGE,nt,Q,382,true,"Arg/N-end rule seed, prt6 vs. Wt",99,29168982,"MASCOT Score",31.6500000,,-0.0644799,0.8092725,NO,0.049199998378754,0.1197316
LDVTPLSLGLETAGGVMTTLIPR,nt,L,400,true,"N-terminal ChaFRADIC",92,26010716,"MASCOT Score",64.5900000,,,,,2.7769999633165E-6,
VTPLSLGLE,nt,V,402,false,"Arg/N-end rule seed, prt6 vs. Wt",99,29168982,"MASCOT Score",54.9000000,,,,,0.00014010000450071,1.6613980
SLGLETAGGVMTTLIPR,nt,S,406,true,"Arg/N-end rule pathway Roots",80,25728785,"MASCOT Score",53.1800000,,,,,4.2039999925692E-8,
SLGLETAGGVMTTLIPR,nt,S,406,true,"Arg/N-end rule seed, prt6 vs. Wt",99,29168982,"MASCOT Score",65.4600000,,-0.3273096,0.3499936,NO,0.00026150001212955,0.4238178
NTTIPTKK,ac,K,429,false,"Quantitative Acetylproteomics",101,29440448,,,,,,,,
TKDNNLLGK,ub,K,457,false,"TAP 6xHis-tag Ub",1,19292762,XCorr,2.3000000,,,,,,
TKDNNLLGK,ub,K,457,false,"Arabidopsis ubiquitination by TUBEs",2,23667124,,,,,,,,
TKDNNLLGK,ub,K,457,false,"Ubiquitination Membrane Proteins",120,33585938,,,,,,,,
TKDNNLLGK,ub,K,457,false,"upl3 mutant / wildtype",168,35926874,"MaxQuant score",103.5500000,1.0000000,-0.0908029,0.6897800,NO,0.00062621000688523,-1.3373000
GVPQITVCFDIDANGILNVSAEDK,so,C,483,false,"S-sulfenylation site detection using YAP1C",110,32714340,,,,,,,,
TTGQKNKITITNDK,ub,K,504,false,"upl3 mutant / wildtype",168,35926874,"MaxQuant score",111.4600000,1.0000000,0.1724875,0.7857800,NO,0.00022676000662614,-1.2931000
KITITNDKGR,nt,K,506,false,"Arabidopsis translation initiation landscape - NT",167b,35069635,,,,,,,,
TTGQKNKITITNDK,ub,K,506,false,"upl3 mutant / wildtype",168,35926874,"MaxQuant score",111.4600000,1.0000000,0.1724875,0.7857800,NO,0.00022676000662614,-1.2931000
NKITITNDKGR,ub,K,506,false,"Ubiquitination Membrane Proteins",120,33585938,,,,,,,,
NKITITNDKGR,ub,K,506,false,"upl3 mutant / wildtype",168,35926874,"MaxQuant score",151.4400000,1.0000000,0.5577777,0.1407980,NO,0.00022676000662614,-0.0734920
ITITNDKGR,ac,K,513,false,"Quantitative Acetylproteomics",101,29440448,,,,,,,,
NKITITNDKGR,ub,K,513,false,"Ubiquitination Membrane Proteins",120,33585938,,,,,,,,
NKITITNDKGR,ub,K,513,false,"upl3 mutant / wildtype",168,35926874,"MaxQuant score",151.4400000,1.0000000,0.5577777,0.1407980,NO,0.00022676000662614,-0.0734920
ITITNDKGR,ub,K,513,false,"Protein ubiquitination during photomorphogenesis",3,28461270,,,,,,,,
ITITNDKGR,ub,K,513,false,"Ubiquitination Membrane Proteins",120,33585938,,,,,,,,
GRLSKDEIEK,ph,S,517,false,"Phospho cell culture sucrose/TOR",109,30833711,,,1.0000000,,,,,
GRLSKDEIEK,ph,S,517,false,"Tissue atlas Arabidopsis - ProteomicsDB",114,32188942,"MaxQuant score",136.3800000,1.0000000,,,,4.8442598199472E-6,
LSKDEIEK,ub,K,518,false,"upl3 mutant / wildtype",168,35926874,"MaxQuant score",83.2060000,1.0000000,0.3115031,0.7882200,NO,0.0053742998279631,-0.5709800
MVQEAEK,mox,M,524,false,"cat2 Methionine oxidation - 1h stress",62a,25693801,"MASCOT Score",56.0000000,,-0.2632439,,NO,,
MVQEAEK,mox,M,524,false,"cat2 Methionine oxidation - 3h stress",62b,25693801,"MASCOT Score",45.0000000,,-0.0171587,,NO,,
MVQEAEKYK,ac,K,530,false,"Quantitative Acetylproteomics",101,29440448,,,,,,,,
MVQEAEKYK,ub,K,530,false,"upl3 mutant / wildtype",168,35926874,"MaxQuant score",123.8600000,1.0000000,-0.0218044,0.9806600,NO,0.0011520800180733,-0.0342260
YKSEDEEHKK,ac,K,532,false,"Quantitative Acetylproteomics",101,29440448,,,,,,,,
MVQEAEKYKSEDEEHK,ph,S,533,false,"Phospho cell culture sucrose/TOR",109,30833711,,,1.0000000,,,,,
YKSEDEEHKK,ph,S,533,false,"atm and atr DNA damage response",88,25561503,"MASCOT Score",25.0000000,0.9570000,,,,,-2.9300000
KVEAKNALENYAYNMR,ac,K,545,false,"Quantitative Acetylproteomics",101,29440448,,,,,,,,
VEAKNALENYAYNMR,ac,K,545,false,"Quantitative Acetylproteomics",101,29440448,,,,,,,,
NALENYAYNMR,nt,N,546,false,"Metacaspase9 substrates - in vitro rMC9",51c,23964026,"MASCOT Score",60.0000000,,1.5207278,,NO,,-0.5541525
NTIQDEKIGEK,ub,K,563,true,"upl3 mutant / wildtype",168,35926874,"MaxQuant score",149.9600000,1.0000000,1.3834969,0.0806200,NO,1.004220040457E-9,0.9666100
IGEKLPAADK,ub,K,567,false,"upl3 mutant / wildtype",168,35926874,"MaxQuant score",97.4520000,1.0000000,0.2856981,0.5061400,NO,0.0016074100276455,0.7577400
MKELESICNPIIAK,ub,K,603,false,"upl3 mutant / wildtype",168,35926874,"MaxQuant score",143.4600000,1.0000000,-0.6620035,,,4.9682802316653E-10,-0.5005100
MKELESICNPIIAK,sno,C,609,false,"Site-specific nitrosomeproteomic id - gsnor1-3",90a,25699590,XCorr,2.8491528,,,,,0.18719999492168,-6.5480363
MKELESICNPIIAK,sno,C,609,false,"Site-specific nitrosomeproteomic id - gsnor1-3",90b,25699590,XCorr,3.2600000,,,,,2.1159999960219E-5,-7.3300000
ELESICNPIIAK,sno,C,609,false,"Site-specific nitrosomeproteomic id - gsnor1-3",90a,25699590,XCorr,2.7118020,,,,,0.10710000246763,-6.8311322
ELESICNPIIAK,sno,C,609,false,"hot5-4 / wildtype, FAT-switch S-nitrosoproteome",169,37277371,,,,,,,,
MKELESICNPIIAK,so,C,609,false,"Arabidopsis S-sulfenylation chemoproteomics",108,31578252,"pFind PSM Score",0.0011450,,,,,,-0.6303634
MKELESICNPIIAK,so,C,609,false,"S-sulfenylation site detection using YAP1C",110,32714340,,,,,,,,
NPIIAKMYQGAGGE,nt,N,610,true,"Arg/N-end rule seed, prt6 vs. Wt",99,29168982,"MASCOT Score",32.0200000,,-0.2089552,0.3604609,NO,7.5790001119458E-7,-0.2380442
IIAKMYQGAGGE,nt,I,612,true,"Arg/N-end rule seed, prt6 vs. Wt",99,29168982,"MASCOT Score",23.1600000,,-0.3905071,0.0089949,NO,0.0012890000361949,-6.1519248
AGGEAGGPGASGMDDDAPPASGGAGPK,nt,A,620,true,"Arabidopsis translation initiation landscape - NT",167b,35069635,,,,,,,,
AGGPGASGMDDDAPPASGGAGPK,nt,A,624,true,"Arabidopsis translation initiation landscape - NT",167b,35069635,,,,,,,,
GGPGASGMDDDAPPASGGAGPK,nt,G,625,true,"Arabidopsis translation initiation landscape - NT",167b,35069635,,,,,,,,
ASGMDDDAPPASGGAGPK,nt,A,629,true,"Arabidopsis translation initiation landscape - NT",167b,35069635,,,,,,,,
MYQGAGGEAGGPGASGMDDDAPPASGGAGPK,ph,S,630,true,"atm and atr DNA damage response",88,25561503,"MASCOT Score",98.0000000,1.0000000,,,,,0.1500000
MYQGAGGEAGGPGASGMDDDAPPASGGAGPK,ph,S,630,true,"TOR Kinase and ABA Receptor",100,29290610,XCorr,3.2038996,0.9992000,,,,9.5039998996072E-5,
GMDDDAPPASGGAGPK,nt,G,631,true,"Arabidopsis translation initiation landscape - NT",167b,35069635,,,,,,,,
MYQGAGGEAGGPGASGMDDDAPPASGGAGPK,ph,S,640,true,"Tissue atlas Arabidopsis - ProteomicsDB",114,32188942,"MaxQuant score",59.9300000,0.9998530,,,,9.0011198494722E-8,
