Peptide,PTM,ModifiedAA,ModifiedPosition,PeptideUniqueToGene,ExperimentDesc,ExpID,PubmedID,ScoreType,IdentScore,LocProb,Log2FChange,PQ-val,QuantSig,PEP,MassErrorPPM
METNSSLFGLVSPSSHDLVIER,nta,M,1,true,"HUNTER N-terminome: legumain, GluC and trypsin",119,31951383,"MaxQuant score",89.0280000,,,,,,
RVSCNSADLTK,ph,S,661,true,"Tissue atlas Arabidopsis - ProteomicsDB",114,32188942,"MaxQuant score",104.9000000,0.9564160,,,,3.8675800169585E-5,
VSCNSADLTK,ox,C,662,true,"OxiTRAQ Arabidopsis - 5 mM H2O2 versus control",47,24376095,,,,0.0410258,0.3646153,NO,,
VMSGSTSDEK,ph,T,1136,true,"atm and atr DNA damage response",88,25561503,"MASCOT Score",50.0000000,0.9970000,,,,,-0.9600000
FLSTLSSSMDDDDPR,ph,S,1170,true,"Tissue atlas Arabidopsis - ProteomicsDB",114,32188942,"MaxQuant score",176.2900000,0.9458740,,,,4.7757102059748E-19,
KISVDGAPDLLR,ph,S,1244,true,"Tissue atlas Arabidopsis - ProteomicsDB",114,32188942,"MaxQuant score",221.2400000,1.0000000,,,,1.891950509922E-39,
MNASSDSLR,ph,S,1257,true,"atm and atr DNA damage response",88,25561503,"MASCOT Score",43.0000000,0.9950000,,,,,-0.9700000
MNASSDSLR,ph,S,1257,true,"Tissue atlas Arabidopsis - ProteomicsDB",114,32188942,"MaxQuant score",100.5500000,0.9888520,,,,0.0011363499797881,
TVTPQGDGPR,ph,T,1504,true,"Tissue atlas Arabidopsis - ProteomicsDB",114,32188942,"MaxQuant score",88.1870000,0.9999900,,,,0.0042554601095617,
VLGQTTIGAVLH,ph,T,2000,true,"Tissue atlas Arabidopsis - ProteomicsDB",114,32188942,"MaxQuant score",97.8130000,0.8332280,,,,0.00040902299224399,
