Peptide,PTM,ModifiedAA,ModifiedPosition,PeptideUniqueToGene,ExperimentDesc,ExpID,PubmedID,ScoreType,IdentScore,LocProb,Log2FChange,PQ-val,QuantSig,PEP,MassErrorPPM
FKDEICSVAFK,so,C,147,true,"Arabidopsis S-sulfenylation chemoproteomics",108,31578252,"pFind PSM Score",0.0365493,,,,,,-0.9901604
ARITPSVSEESTDGLNGNDGVSLPR,ph,T,376,true,"SnRK2 protein kinase substrates",85,23776212,XCorr,3.1606998,0.8810000,,,,1.7297199974564E-6,
ARITPSVSEESTDGLNGNDGVSLPR,ph,T,376,true,"Tissue atlas Arabidopsis - ProteomicsDB",114,32188942,"MaxQuant score",128.8700000,0.9972820,,,,6.3749499309907E-28,
ARITPSVSEESTDGLNGNDGVSLPR,ph,S,378,true,"LAXIC - mannitol vs control",84b,23660473,XCorr,2.8700000,0.7750000,,,,0.034737300127745,
ARITPSVSEESTDGLNGNDGVSLPR,ph,S,380,true,"LAXIC - mannitol vs control",84b,23660473,XCorr,2.8700000,0.7970000,,,,0.034737300127745,
ITPSVSEESTDGLNGNDGVSLPR,ph,S,380,true,"Tissue atlas Arabidopsis - ProteomicsDB",114,32188942,"MaxQuant score",141.5000000,0.9945440,,,,6.7187901761927E-30,
ARITPSVSEESTDGLNGNDGVSLPR,ph,S,383,true,"LAXIC - mannitol vs control",84b,23660473,XCorr,2.8700000,0.7970000,,,,0.034737300127745,
ARITPSVSEESTDGLNGNDGVSLPR,ph,S,383,true,"SnRK2 protein kinase substrates",85,23776212,XCorr,3.1606998,0.8810000,,,,1.7297199974564E-6,
ITPSVSEESTDGLNGNDGVSLPR,ph,S,383,true,"Tissue atlas Arabidopsis - ProteomicsDB",114,32188942,"MaxQuant score",124.2000000,0.8113880,,,,8.6184404425265E-22,
ARITPSVSEESTDGLNGNDGVSLPR,ph,T,384,true,"SnRK2 protein kinase substrates",85,23776212,XCorr,3.1606998,0.8810000,,,,1.7297199974564E-6,
VASTSTGPSDSR,ph,S,400,true,"Tissue atlas Arabidopsis - ProteomicsDB",114,32188942,"MaxQuant score",95.1830000,0.9672090,,,,0.0001691090001259,
TPPGLLATCDTSFPENEESNTVSPQNVHYIGNR,ph,T,538,true,"Tissue atlas Arabidopsis - ProteomicsDB",114,32188942,"MaxQuant score",218.2200000,1.0000000,,,,0,
TPPGLLATCDTSFPENEESNTVSPQNVHYIGNR,ph,S,560,true,"Tissue atlas Arabidopsis - ProteomicsDB",114,32188942,"MaxQuant score",469.8800000,0.9999440,,,,0,
LLVDVIPSMSVDKLEEFSPK,ph,S,631,true,"Large-scale phosphorylation discovery",44,23111157,XCorr,4.1450000,,,,,,
LLVDVIPSMSVDKLEEFSPK,ph,S,631,true,"SnRK2 protein kinase substrates",85,23776212,XCorr,2.6133935,1.0000000,,,,0.0049393298104405,
LLVDVIPSMSVDKLEEFSPK,ph,S,631,true,"Tissue atlas Arabidopsis - ProteomicsDB",114,32188942,"MaxQuant score",241.4400000,1.0000000,,,,0,
LEEFSPK,ph,S,631,true,"srk2dei ABA signaling phopshoproteomics",83,23572148,"MASCOT Score",27.0000000,,,,,,0.0001000
LEEFSPK,ph,S,631,true,"TOR Kinase and ABA Receptor",100,29290610,XCorr,2.2872310,1.0000000,,,,0.013670000247657,
SEMSQSQNSPIDTGR,ph,S,1332,true,"atm and atr DNA damage response",88,25561503,"MASCOT Score",51.0000000,1.0000000,,,,,-0.0700000
SEMSQSQNSPIDTGR,ph,S,1332,true,"Lateral root-induction - NAA vs control",106,23328941,"MASCOT Score",33.0000000,,,,,,
SEMSQSQNSPIDTGR,ph,S,1332,true,"Tissue atlas Arabidopsis - ProteomicsDB",114,32188942,"MaxQuant score",208.8600000,0.9999790,,,,1.4012984643248E-45,
SEMSQSQNSPIDTGR,ph,S,1334,true,"Tyrosine phosphorylation in Arabidopsis",59,18463617,"MASCOT Score",54.0000000,,,,,,-0.4662871
SEMSQSQNSPIDTGR,ph,S,1334,true,"LAXIC - mannitol vs control",84b,23660473,XCorr,3.7700000,0.9990000,,,,0.0013680399861187,
SEMSQSQNSPIDTGR,ph,S,1334,true,"atm and atr DNA damage response",88,25561503,"MASCOT Score",71.0000000,0.9920000,,,,,-0.5000000
SEMSQSQNSPIDTGR,ph,S,1334,true,"Lateral root-induction - NAA vs control",106,23328941,"MASCOT Score",49.0000000,,,,,,
SEMSQSQNSPIDTGR,ph,S,1334,true,"Tissue atlas Arabidopsis - ProteomicsDB",114,32188942,"MaxQuant score",276.4700000,1.0000000,,,,0,
SEMSQSQNSPIDTGR,ph,S,1337,true,"Large-scale phosphorylation discovery",44,23111157,XCorr,4.5880000,,,,,,
SEMSQSQNSPIDTGR,ph,S,1337,true,"Tyrosine phosphorylation in Arabidopsis",59,18463617,"MASCOT Score",62.0000000,,,,,,-0.5245730
SEMSQSQNSPIDTGR,ph,S,1337,true,"Chloroplast kinase substrates",60,19376835,"MASCOT Score",34.8700000,,,,,,-0.7719840
SEMSQSQNSPIDTGR,ph,S,1337,true,"srk2dei ABA signaling phopshoproteomics",83,23572148,"MASCOT Score",46.0000000,,,,,,-0.0014000
SEMSQSQNSPIDTGR,ph,S,1337,true,"LAXIC - ABA stress",84a,23660473,XCorr,4.1300000,0.9970000,,,,0.015412000007927,
SEMSQSQNSPIDTGR,ph,S,1337,true,"LAXIC - mannitol vs control",84b,23660473,XCorr,3.7700000,1.0000000,,,,0.0013680399861187,
SEMSQSQNSPIDTGR,ph,S,1337,true,"SnRK2 protein kinase substrates",85,23776212,XCorr,3.8993776,1.0000000,,,,0.0040365098975599,
SEMSQSQNSPIDTGR,ph,S,1337,true,"atm and atr DNA damage response",88,25561503,"MASCOT Score",72.0000000,0.9960000,,,,,-0.2900000
SEMSQSQNSPIDTGR,ph,S,1337,true,"TOR Kinase and ABA Receptor",100,29290610,XCorr,5.1307855,0.9996000,,,,1.2329999663052E-5,
SEMSQSQNSPIDTGR,ph,S,1337,true,"Lateral root-induction - NAA vs control",106,23328941,"MASCOT Score",52.0000000,,,,,,
SEMSQSQNSPIDTGR,ph,S,1337,true,"Phospho cell culture sucrose/TOR",109,30833711,,,0.9999990,,,,,
SEMSQSQNSPIDTGR,ph,S,1337,true,"Col-0 callus - FC Col-0 vs. Col-0 Xray",111a,31410901,,40.0800000,,-1.6568166,0.0000000,NO,,0.6216260
SEMSQSQNSPIDTGR,ph,S,1337,true,"Col-0 X-ray callus - FC Col-0 vs. Col-0 Xray",111b,31410901,,40.0800000,,-1.6568166,0.0000000,NO,,0.6216260
SEMSQSQNSPIDTGR,ph,S,1337,true,"atm callus - FC atm vs. atm Xray",111c,31410901,,40.0800000,,0.2352676,0.0000000,NO,,0.6216260
SEMSQSQNSPIDTGR,ph,S,1337,true,"atm-3 X-ray callus - FC atm vs. atm Xray",111d,31410901,,40.0800000,,0.2352676,0.0000000,NO,,0.6216260
SEMSQSQNSPIDTGR,ph,S,1337,true,"Tissue atlas Arabidopsis - ProteomicsDB",114,32188942,"MaxQuant score",424.5300000,1.0000000,,,,0,
SEMSQSQNSPIDTGR,ph,T,1341,true,"Tyrosine phosphorylation in Arabidopsis",59,18463617,"MASCOT Score",29.0000000,,,,,,-1.8068647
SEMSQSQNSPIDTGR,ph,T,1341,true,"atm and atr DNA damage response",88,25561503,"MASCOT Score",71.0000000,1.0000000,,,,,-0.5000000
SEMSQSQNSPIDTGR,ph,S,1347,true,"atm and atr DNA damage response",88,25561503,"MASCOT Score",51.0000000,1.0000000,,,,,-0.0700000
SEMSQSQNSPIDTGR,ph,S,1347,true,"Lateral root-induction - NAA vs control",106,23328941,"MASCOT Score",33.0000000,,,,,,
SEMSQSQNSPIDTGR,ph,S,1347,true,"Tissue atlas Arabidopsis - ProteomicsDB",114,32188942,"MaxQuant score",208.8600000,0.9999790,,,,1.4012984643248E-45,
SEMSQSQNSPIDTGR,ph,S,1349,true,"Tyrosine phosphorylation in Arabidopsis",59,18463617,"MASCOT Score",54.0000000,,,,,,-0.4662871
SEMSQSQNSPIDTGR,ph,S,1349,true,"LAXIC - mannitol vs control",84b,23660473,XCorr,3.7700000,0.9990000,,,,0.0013680399861187,
SEMSQSQNSPIDTGR,ph,S,1349,true,"atm and atr DNA damage response",88,25561503,"MASCOT Score",71.0000000,0.9920000,,,,,-0.5000000
SEMSQSQNSPIDTGR,ph,S,1349,true,"Lateral root-induction - NAA vs control",106,23328941,"MASCOT Score",49.0000000,,,,,,
SEMSQSQNSPIDTGR,ph,S,1349,true,"Tissue atlas Arabidopsis - ProteomicsDB",114,32188942,"MaxQuant score",276.4700000,1.0000000,,,,0,
SEMSQSQNSPIDTGR,ph,S,1352,true,"Large-scale phosphorylation discovery",44,23111157,XCorr,4.5880000,,,,,,
SEMSQSQNSPIDTGR,ph,S,1352,true,"Tyrosine phosphorylation in Arabidopsis",59,18463617,"MASCOT Score",62.0000000,,,,,,-0.5245730
SEMSQSQNSPIDTGR,ph,S,1352,true,"Chloroplast kinase substrates",60,19376835,"MASCOT Score",34.8700000,,,,,,-0.7719840
SEMSQSQNSPIDTGR,ph,S,1352,true,"srk2dei ABA signaling phopshoproteomics",83,23572148,"MASCOT Score",46.0000000,,,,,,-0.0014000
SEMSQSQNSPIDTGR,ph,S,1352,true,"LAXIC - ABA stress",84a,23660473,XCorr,4.1300000,0.9970000,,,,0.015412000007927,
SEMSQSQNSPIDTGR,ph,S,1352,true,"LAXIC - mannitol vs control",84b,23660473,XCorr,3.7700000,1.0000000,,,,0.0013680399861187,
SEMSQSQNSPIDTGR,ph,S,1352,true,"SnRK2 protein kinase substrates",85,23776212,XCorr,3.8993776,1.0000000,,,,0.0040365098975599,
SEMSQSQNSPIDTGR,ph,S,1352,true,"atm and atr DNA damage response",88,25561503,"MASCOT Score",72.0000000,0.9960000,,,,,-0.2900000
SEMSQSQNSPIDTGR,ph,S,1352,true,"TOR Kinase and ABA Receptor",100,29290610,XCorr,5.1307855,0.9996000,,,,1.2329999663052E-5,
SEMSQSQNSPIDTGR,ph,S,1352,true,"Lateral root-induction - NAA vs control",106,23328941,"MASCOT Score",52.0000000,,,,,,
SEMSQSQNSPIDTGR,ph,S,1352,true,"Phospho cell culture sucrose/TOR",109,30833711,,,0.9999990,,,,,
SEMSQSQNSPIDTGR,ph,S,1352,true,"Col-0 callus - FC Col-0 vs. Col-0 Xray",111a,31410901,,40.0800000,,-1.6568166,0.0000000,NO,,0.6216260
SEMSQSQNSPIDTGR,ph,S,1352,true,"Col-0 X-ray callus - FC Col-0 vs. Col-0 Xray",111b,31410901,,40.0800000,,-1.6568166,0.0000000,NO,,0.6216260
SEMSQSQNSPIDTGR,ph,S,1352,true,"atm callus - FC atm vs. atm Xray",111c,31410901,,40.0800000,,0.2352676,0.0000000,NO,,0.6216260
SEMSQSQNSPIDTGR,ph,S,1352,true,"atm-3 X-ray callus - FC atm vs. atm Xray",111d,31410901,,40.0800000,,0.2352676,0.0000000,NO,,0.6216260
SEMSQSQNSPIDTGR,ph,S,1352,true,"Tissue atlas Arabidopsis - ProteomicsDB",114,32188942,"MaxQuant score",424.5300000,1.0000000,,,,0,
SEMSQSQNSPIDTGR,ph,T,1356,true,"Tyrosine phosphorylation in Arabidopsis",59,18463617,"MASCOT Score",29.0000000,,,,,,-1.8068647
SEMSQSQNSPIDTGR,ph,T,1356,true,"atm and atr DNA damage response",88,25561503,"MASCOT Score",71.0000000,1.0000000,,,,,-0.5000000
SEMSQSQNSPIDTGR,ph,S,1362,true,"atm and atr DNA damage response",88,25561503,"MASCOT Score",51.0000000,1.0000000,,,,,-0.0700000
SEMSQSQNSPIDTGR,ph,S,1362,true,"Lateral root-induction - NAA vs control",106,23328941,"MASCOT Score",33.0000000,,,,,,
SEMSQSQNSPIDTGR,ph,S,1362,true,"Tissue atlas Arabidopsis - ProteomicsDB",114,32188942,"MaxQuant score",208.8600000,0.9999790,,,,1.4012984643248E-45,
SEMSQSQNSPIDTGR,ph,S,1364,true,"Tyrosine phosphorylation in Arabidopsis",59,18463617,"MASCOT Score",54.0000000,,,,,,-0.4662871
SEMSQSQNSPIDTGR,ph,S,1364,true,"LAXIC - mannitol vs control",84b,23660473,XCorr,3.7700000,0.9990000,,,,0.0013680399861187,
SEMSQSQNSPIDTGR,ph,S,1364,true,"atm and atr DNA damage response",88,25561503,"MASCOT Score",71.0000000,0.9920000,,,,,-0.5000000
SEMSQSQNSPIDTGR,ph,S,1364,true,"Lateral root-induction - NAA vs control",106,23328941,"MASCOT Score",49.0000000,,,,,,
SEMSQSQNSPIDTGR,ph,S,1364,true,"Tissue atlas Arabidopsis - ProteomicsDB",114,32188942,"MaxQuant score",276.4700000,1.0000000,,,,0,
SEMSQSQNSPIDTGR,ph,S,1367,true,"Large-scale phosphorylation discovery",44,23111157,XCorr,4.5880000,,,,,,
SEMSQSQNSPIDTGR,ph,S,1367,true,"Tyrosine phosphorylation in Arabidopsis",59,18463617,"MASCOT Score",62.0000000,,,,,,-0.5245730
SEMSQSQNSPIDTGR,ph,S,1367,true,"Chloroplast kinase substrates",60,19376835,"MASCOT Score",34.8700000,,,,,,-0.7719840
SEMSQSQNSPIDTGR,ph,S,1367,true,"srk2dei ABA signaling phopshoproteomics",83,23572148,"MASCOT Score",46.0000000,,,,,,-0.0014000
SEMSQSQNSPIDTGR,ph,S,1367,true,"LAXIC - ABA stress",84a,23660473,XCorr,4.1300000,0.9970000,,,,0.015412000007927,
SEMSQSQNSPIDTGR,ph,S,1367,true,"LAXIC - mannitol vs control",84b,23660473,XCorr,3.7700000,1.0000000,,,,0.0013680399861187,
SEMSQSQNSPIDTGR,ph,S,1367,true,"SnRK2 protein kinase substrates",85,23776212,XCorr,3.8993776,1.0000000,,,,0.0040365098975599,
SEMSQSQNSPIDTGR,ph,S,1367,true,"atm and atr DNA damage response",88,25561503,"MASCOT Score",72.0000000,0.9960000,,,,,-0.2900000
SEMSQSQNSPIDTGR,ph,S,1367,true,"TOR Kinase and ABA Receptor",100,29290610,XCorr,5.1307855,0.9996000,,,,1.2329999663052E-5,
SEMSQSQNSPIDTGR,ph,S,1367,true,"Lateral root-induction - NAA vs control",106,23328941,"MASCOT Score",52.0000000,,,,,,
SEMSQSQNSPIDTGR,ph,S,1367,true,"Phospho cell culture sucrose/TOR",109,30833711,,,0.9999990,,,,,
SEMSQSQNSPIDTGR,ph,S,1367,true,"Col-0 callus - FC Col-0 vs. Col-0 Xray",111a,31410901,,40.0800000,,-1.6568166,0.0000000,NO,,0.6216260
SEMSQSQNSPIDTGR,ph,S,1367,true,"Col-0 X-ray callus - FC Col-0 vs. Col-0 Xray",111b,31410901,,40.0800000,,-1.6568166,0.0000000,NO,,0.6216260
SEMSQSQNSPIDTGR,ph,S,1367,true,"atm callus - FC atm vs. atm Xray",111c,31410901,,40.0800000,,0.2352676,0.0000000,NO,,0.6216260
SEMSQSQNSPIDTGR,ph,S,1367,true,"atm-3 X-ray callus - FC atm vs. atm Xray",111d,31410901,,40.0800000,,0.2352676,0.0000000,NO,,0.6216260
SEMSQSQNSPIDTGR,ph,S,1367,true,"Tissue atlas Arabidopsis - ProteomicsDB",114,32188942,"MaxQuant score",424.5300000,1.0000000,,,,0,
SEMSQSQNSPIDTGR,ph,T,1371,true,"Tyrosine phosphorylation in Arabidopsis",59,18463617,"MASCOT Score",29.0000000,,,,,,-1.8068647
SEMSQSQNSPIDTGR,ph,T,1371,true,"atm and atr DNA damage response",88,25561503,"MASCOT Score",71.0000000,1.0000000,,,,,-0.5000000
TSDPQASSQTLRDDDEK,ph,S,1420,true,"Tissue atlas Arabidopsis - ProteomicsDB",114,32188942,"MaxQuant score",133.8800000,0.9304380,,,,2.5057400598882E-11,
TSDPQASSQTLR,ph,S,1420,true,"atm and atr DNA damage response",88,25561503,"MASCOT Score",52.0000000,0.9950000,,,,,0.1300000
TSDPQASSQTLR,ph,S,1425,true,"Tissue atlas Arabidopsis - ProteomicsDB",114,32188942,"MaxQuant score",127.7800000,0.9825700,,,,2.7059999852123E-18,
TSDPQASSQTLR,ph,S,1426,true,"Tissue atlas Arabidopsis - ProteomicsDB",114,32188942,"MaxQuant score",131.8600000,0.9563610,,,,2.7059999852123E-18,
TSDPQASSQTLRDDDEK,ph,T,1428,true,"TOR Kinase and ABA Receptor",100,29290610,XCorr,3.6516178,0.9627000,,,,0.02309999987483,
TSDPQASSQTLRDDDEKIDDTATSENEVTEIEK,ph,T,1439,true,"Tissue atlas Arabidopsis - ProteomicsDB",114,32188942,"MaxQuant score",98.7350000,0.8086060,,,,2.2210299900407E-25,
DDDEKIDDTATSENEVTEIEK,ph,S,1442,true,"LAXIC - mannitol vs control",84b,23660473,XCorr,3.4400000,0.9800000,,,,6.720000250704E-11,
DDDEKIDDTATSENEVTEIEK,ph,S,1442,true,"SnRK2 protein kinase substrates",85,23776212,XCorr,2.9876974,0.9880000,,,,0.0011626300401986,
DDDEKIDDTATSENEVTEIEK,ph,S,1442,true,"Tissue atlas Arabidopsis - ProteomicsDB",114,32188942,"MaxQuant score",443.4900000,0.9997910,,,,0,
IDDTATSENEVTEIEK,ph,S,1442,true,"STN8 phosphoproteome",38,21768351,"MASCOT Score",53.2100000,,,,,,-1.3134100
IDDTATSENEVTEIEK,ph,S,1442,true,"Tyrosine phosphorylation in Arabidopsis",59,18463617,"MASCOT Score",86.0000000,,,,,,-1.1213243
IDDTATSENEVTEIEK,ph,S,1442,true,"srk2dei ABA signaling phopshoproteomics",83,23572148,"MASCOT Score",71.0000000,,,,,,0.0002000
IDDTATSENEVTEIEK,ph,S,1442,true,"LAXIC - ABA stress",84a,23660473,XCorr,4.5400000,0.9980000,,,,4.0000000467444E-7,
IDDTATSENEVTEIEK,ph,S,1442,true,"LAXIC - mannitol vs control",84b,23660473,XCorr,5.3700000,0.9990000,-2.0802222,,NO,0.00017340600606985,
IDDTATSENEVTEIEK,ph,S,1442,true,"SnRK2 protein kinase substrates",85,23776212,XCorr,3.7211814,0.9990000,,,,2.3198599308216E-7,
IDDTATSENEVTEIEK,ph,S,1442,true,"TOR Kinase and ABA Receptor",100,29290610,XCorr,5.2682886,0.9322000,,,,5.4619999190209E-8,
IDDTATSENEVTEIEK,ph,S,1442,true,"Phospho cell culture sucrose/TOR",109,30833711,,,0.9982770,,,,,
IDDTATSENEVTEIEK,ph,T,1447,true,"Tissue atlas Arabidopsis - ProteomicsDB",114,32188942,"MaxQuant score",93.3420000,0.9956310,,,,0.0002974699891638,
SKESSEEEEEEEEEEE,ph,S,1452,true,"srk2dei ABA signaling phopshoproteomics",83,23572148,"MASCOT Score",30.0000000,,,,,,-0.0005000
SKESSEEEEEEEEEEE,ph,S,1455,true,"srk2dei ABA signaling phopshoproteomics",83,23572148,"MASCOT Score",41.0000000,,,,,,0.0003000
SKESSEEEEEEEEEEE,ph,S,1455,true,"LAXIC - mannitol vs control",84b,23660473,XCorr,4.9000000,0.9970000,,,,1.3099999803998E-15,
SKESSEEEEEEEEEEE,ph,S,1455,true,"SnRK2 protein kinase substrates",85,23776212,XCorr,4.6873899,0.9710000,,,,2.5671999537735E-5,
SKESSEEEEEEEEEEE,ph,S,1455,true,"TOR Kinase and ABA Receptor",100,29290610,XCorr,5.3028722,0.9929000,,,,1.2749999768857E-5,
SKESSEEEEEEEEEEE,ph,S,1456,true,"srk2dei ABA signaling phopshoproteomics",83,23572148,"MASCOT Score",38.0000000,,,,,,-0.0006000
SKESSEEEEEEEEEEE,ph,S,1456,true,"TOR Kinase and ABA Receptor",100,29290610,XCorr,5.3028722,0.9929000,,,,1.2749999768857E-5,
