Peptide,PTM,ModifiedAA,ModifiedPosition,PeptideUniqueToGene,ExperimentDesc,ExpID,PubmedID,ScoreType,IdentScore,LocProb,Log2FChange,PQ-val,QuantSig,PEP,MassErrorPPM
DEAAVFTPQAQAQQLQK,ph,T,14,true,"Tissue atlas Arabidopsis - ProteomicsDB",114,32188942,"MaxQuant score",212.3500000,1.0000000,,,,0,
SVSDLSDPSTPR,ph,S,29,true,"atm and atr DNA damage response",88,25561503,"MASCOT Score",33.0000000,0.9990000,,,,,-0.0100000
SVSDLSDPSTPR,ph,S,29,true,"Tissue atlas Arabidopsis - ProteomicsDB",114,32188942,"MaxQuant score",135.0200000,0.9980130,,,,2.4872499125195E-5,
SVSDLSDPSTPR,ph,S,31,true,"STN8 phosphoproteome",38,21768351,"MASCOT Score",40.7600000,,,,,,
SVSDLSDPSTPR,ph,S,31,true,"atm and atr DNA damage response",88,25561503,"MASCOT Score",59.0000000,1.0000000,,,,,-0.0700000
SVSDLSDPSTPR,ph,S,31,true,"Tissue atlas Arabidopsis - ProteomicsDB",114,32188942,"MaxQuant score",220.5300000,0.9999990,,,,2.9651699712867E-39,
SVSDLSDPSTPR,ph,S,34,true,"Phosphorylation Early Elicitor Signaling",23,17317660,,,,,,,,
SVSDLSDPSTPR,ph,S,34,true,"atm and atr DNA damage response",88,25561503,"MASCOT Score",37.0000000,1.0000000,,,,,-1.0200000
SVSDLSDPSTPR,ph,S,34,true,"Tissue atlas Arabidopsis - ProteomicsDB",114,32188942,"MaxQuant score",159.1200000,0.9999630,,,,7.3077799367383E-10,
SVSDLSDPSTPR,ph,S,37,true,"atm and atr DNA damage response",88,25561503,"MASCOT Score",35.0000000,1.0000000,,,,,-0.5500000
SVSDLSDPSTPR,ph,S,37,true,"Tissue atlas Arabidopsis - ProteomicsDB",114,32188942,"MaxQuant score",159.4100000,0.8846410,,,,5.6711002560661E-10,
KHSRSVSDLSDPSTPR,ph,T,38,true,"Large-scale phosphorylation discovery",44,23111157,XCorr,2.6630000,,,,,,
SVSDLSDPSTPR,ph,T,38,true,"atm and atr DNA damage response",88,25561503,"MASCOT Score",42.0000000,0.9940000,,,,,0.3800000
SVSDLSDPSTPR,ph,T,38,true,"Tissue atlas Arabidopsis - ProteomicsDB",114,32188942,"MaxQuant score",171.1100000,0.8476670,,,,5.3121901680015E-14,
AGPQGDETHVSTR,ph,S,233,true,"atm and atr DNA damage response",88,25561503,"MASCOT Score",76.0000000,0.9570000,,,,,-0.6100000
AGPQGDETHVSTR,ph,S,233,true,"Tissue atlas Arabidopsis - ProteomicsDB",114,32188942,"MaxQuant score",186.9600000,0.9830260,,,,2.6289000450124E-22,
SPNPNYSPGGPAACR,ph,S,394,true,"Tissue atlas Arabidopsis - ProteomicsDB",114,32188942,"MaxQuant score",206.5500000,1.0000000,,,,0,
SPNPNYSPGGPAACR,ph,S,400,true,"Tissue atlas Arabidopsis - ProteomicsDB",114,32188942,"MaxQuant score",144.4100000,0.9999970,,,,1.5175899539998E-34,
