Peptide,PTM,ModifiedAA,ModifiedPosition,PeptideUniqueToGene,ExperimentDesc,ExpID,PubmedID,ScoreType,IdentScore,LocProb,Log2FChange,PQ-val,QuantSig,PEP,MassErrorPPM
DTDFYSVLGVSKNATKAEIKSAYR,nt,D,83,true,"HUNTER N-terminome: legumain, GluC and trypsin",119,31951383,"MaxQuant score",112.8500000,,,,,,
DTDFYSVLGVSKN,nt,D,83,true,"HUNTER N-terminome: legumain, GluC and trypsin",119,31951383,"MaxQuant score",188.9600000,,,,,,
AEIKSAYR,ac,K,102,false,"Quantitative Acetylproteomics",101,29440448,,,,,,,,
DAGAEDKFK,ac,K,125,true,"Histone deacetylases - apicidin vs control",98a,29061669,"MaxQuant Score",84.7000000,1.0000000,0.1460000,0.3962780,NO,0.013000000268221,
DAGAEDKFK,ac,K,125,true,"Quantitative Acetylproteomics",101,29440448,,,,,,,,
LESCGTCNGSGAK,ph,T,232,true,"Tissue atlas Arabidopsis - ProteomicsDB",114,32188942,"MaxQuant score",79.8750000,0.9868260,,,,0.0027044299058616,
TCGGQGQVVASTR,ox,C,250,true,"OxiTRAQ Arabidopsis - 5 mM H2O2 versus control",47,24376095,,,,0.3015383,0.0393616,NO,,
ISLKVPAGVDSGSR,ub,K,304,false,"Arabidopsis ubiquitination COFRADIC",40,26744219,"MaxQuant Score",71.2790000,1.0000000,,,,4.6049999582465E-6,0.0990000
RDDTNILYTCK,acy,C,356,false,"Arabidopsis S-acylation atlas - Meristem",163a,35681017,,,,,,,,
DDTNILYTCK,sno,C,356,false,"hot5-4 / wildtype, FAT-switch S-nitrosoproteome",169,37277371,,,,0.4022334,0.0315770,NO,,
RDDTNILYTCK,so,C,356,false,"S-sulfenylation site detection using YAP1C",110,32714340,,,,,,,,
VQVEIPKR,ac,K,421,false,"Quantitative Acetylproteomics",101,29440448,,,,,,,,
VQVEIPKR,ub,K,421,false,"Arabidopsis ubiquitination COFRADIC",40,26744219,"MaxQuant Score",114.2800000,1.0000000,,,,0.003000000026077,0.4580000
