Peptide,PTM,ModifiedAA,ModifiedPosition,PeptideUniqueToGene,ExperimentDesc,ExpID,PubmedID,ScoreType,IdentScore,LocProb,Log2FChange,PQ-val,QuantSig,PEP,MassErrorPPM
SSSPFPVLDNR,nt,S,2,true,"Arg/N-end rule seed, prt6 vs. Wt",99,29168982,"MASCOT Score",54.8600000,,,,,0.028680000454187,-0.9290361
SSSPFPVLDNRPIDKW,nta,S,2,true,"Arg/N-end rule pathway Roots",80,25728785,"MASCOT Score",42.8500000,,,,,0.0018980000168085,
SSSPFPVLDNR,nta,S,2,true,"Arg/N-end rule seed, prt6 vs. Wt",99,29168982,"MASCOT Score",54.8600000,,,,,0.028680000454187,-0.9290361
SSSPFPVLDN,nta,S,2,true,"HUNTER N-terminome: legumain, GluC and trypsin",119,31951383,"MaxQuant score",164.9600000,,,,,,
SSSPFPVLDNRPIDK,ph,S,2,true,"Tissue atlas Arabidopsis - ProteomicsDB",114,32188942,"MaxQuant score",159.1800000,0.9823230,,,,5.221899843956E-13,
SSSPFPVLDNRPIDK,ph,S,4,true,"atm and atr DNA damage response",88,25561503,"MASCOT Score",38.0000000,0.8690000,,,,,-0.2900000
SSSPFPVLDNRPIDK,ph,S,4,true,"Tissue atlas Arabidopsis - ProteomicsDB",114,32188942,"MaxQuant score",261.6100000,0.9971120,,,,0,
WKVTELKEELK,ph,T,20,true,"Tissue atlas Arabidopsis - ProteomicsDB",114,32188942,"MaxQuant score",137.7300000,1.0000000,,,,8.9718298568187E-7,
WKVTELK,ph,T,20,true,"TOR Kinase and ABA Receptor",100,29290610,XCorr,2.6788764,1.0000000,,,,0.018079999834299,
GLKEELVR,nt,G,35,true,"Metacaspase9 substrates - in vitro rMC9",51c,23964026,"MASCOT Score",56.0000000,,,,,,0.0000000
INSATVAAAEK,ph,S,60,true,"Tissue atlas Arabidopsis - ProteomicsDB",114,32188942,"MaxQuant score",164.5600000,0.9999560,,,,4.4661101206156E-11,
NQTTPVTPVEAAFSTETTPVTAEK,ph,T,90,true,"SnRK2 protein kinase substrates",85,23776212,XCorr,2.5662658,0.9930000,,,,0.00040136999450624,
NQTTPVTPVEAAFSTETTPVTAEK,ph,T,90,true,"TOR Kinase and ABA Receptor",100,29290610,XCorr,5.1391821,0.9999000,,,,6.9500001700362E-6,
NQTTPVTPVEAAFSTETTPVTAEK,ph,T,90,true,"Lateral root-induction - NAA vs control",106,23328941,"MASCOT Score",56.0000000,,,,,,
NQTTPVTPVEAAFSTETTPVTAEK,ph,T,90,true,"Tissue atlas Arabidopsis - ProteomicsDB",114,32188942,"MaxQuant score",64.7200000,0.9630690,,,,4.5297301198843E-7,
NQTTPVTPVEAAFSTETTPVTAEKTPEPTQTK,ph,T,108,true,"Tissue atlas Arabidopsis - ProteomicsDB",114,32188942,"MaxQuant score",230.2600000,0.9609060,,,,0,
ITTEASAGVETTPAPVFSEPEVNAVPFASDEDEKEKVDDVR,ph,S,144,true,"Phospho cell culture sucrose/TOR",109,30833711,,,0.9994620,,,,,
ITTEASAGVETTPAPVFSEPEVNAVPFASDEDEKEKVDDVR,ph,S,144,true,"Tissue atlas Arabidopsis - ProteomicsDB",114,32188942,"MaxQuant score",320.1100000,1.0000000,,,,0,
ITTEASAGVETTPAPVFSEPEVNAVPFASDEDEKEK,ph,S,144,true,"SnRK2 protein kinase substrates",85,23776212,XCorr,5.8543873,0.9990000,,,,4.7489897451525E-16,
ITTEASAGVETTPAPVFSEPEVNAVPFASDEDEK,ph,S,144,true,"TOR Kinase and ABA Receptor",100,29290610,XCorr,5.2188907,1.0000000,,,,1.5889999360752E-7,
DIAGLDSSVVAR,nt,D,157,true,"Metacaspase9 substrates - in vitro rMC9",51c,23964026,"MASCOT Score",92.0000000,,3.4439976,,NO,,-0.3145464
DIAGLDSSVVAR,ph,S,163,true,"Tissue atlas Arabidopsis - ProteomicsDB",114,32188942,"MaxQuant score",134.6100000,0.9206330,,,,2.6147899916396E-5,
DIAGLDSSVVAR,ph,S,164,true,"Tissue atlas Arabidopsis - ProteomicsDB",114,32188942,"MaxQuant score",147.7300000,0.9581000,,,,9.2727401579396E-7,
DAAVVQVASSEHKSENNEPFSGLDGGDSK,ph,S,177,true,"SnRK2 protein kinase substrates",85,23776212,XCorr,2.9318490,0.8110000,,,,4.3402000743376E-13,
DAAVVQVASSEHKSENNEPFSGLDGGDSK,ph,S,177,true,"Col-0 callus - FC Col-0 vs. Col-0 Xray",111a,31410901,,32.5600000,,0.4453415,0.0000000,NO,,0.6209610
DAAVVQVASSEHKSENNEPFSGLDGGDSK,ph,S,177,true,"Col-0 X-ray callus - FC Col-0 vs. Col-0 Xray",111b,31410901,,32.5600000,,0.4453415,0.0000000,NO,,0.6209610
DAAVVQVASSEHKSENNEPFSGLDGGDSK,ph,S,177,true,"atm callus - FC atm vs. atm Xray",111c,31410901,,32.5600000,,1.5574301,0.0000000,NO,,0.6209610
DAAVVQVASSEHKSENNEPFSGLDGGDSK,ph,S,177,true,"atm-3 X-ray callus - FC atm vs. atm Xray",111d,31410901,,32.5600000,,1.5574301,0.0000000,NO,,0.6209610
DAAVVQVASSEHK,ph,S,177,true,"Chloroplast kinase substrates",60,19376835,"MASCOT Score",33.6300000,,,,,,-0.6347410
DAAVVQVASSEHK,ph,S,177,true,"SnRK2 protein kinase substrates",85,23776212,XCorr,3.6872380,0.9530000,,,,0.00063285097712651,
DAAVVQVASSEHK,ph,S,177,true,"atm and atr DNA damage response",88,25561503,"MASCOT Score",74.0000000,0.9540000,,,,,-0.0600000
DAAVVQVASSEHK,ph,S,177,true,"TOR Kinase and ABA Receptor",100,29290610,XCorr,4.3751197,0.9363000,,,,8.1830000908667E-7,
DAAVVQVASSEHK,ph,S,177,true,"Lateral root-induction - NAA vs control",106,23328941,"MASCOT Score",63.0000000,,,,,,
DAAVVQVASSEHK,ph,S,177,true,"Tissue atlas Arabidopsis - ProteomicsDB",114,32188942,"MaxQuant score",233.6200000,1.0000000,,,,0,
DAAVVQVASSEHK,ph,S,178,true,"srk2dei ABA signaling phopshoproteomics",83,23572148,"MASCOT Score",23.0000000,,,,,,0.0001000
DAAVVQVASSEHK,ph,S,178,true,"atm and atr DNA damage response",88,25561503,"MASCOT Score",49.0000000,0.9620000,,,,,0.0000000
DAAVVQVASSEHK,ph,S,178,true,"Lateral root-induction - NAA vs control",106,23328941,"MASCOT Score",54.0000000,,,,,,
DAAVVQVASSEHK,ph,S,178,true,"Col-0 callus - FC Col-0 vs. Col-0 Xray",111a,31410901,,26.8500000,,-2.2756912,0.0000000,NO,,-0.1038237
DAAVVQVASSEHK,ph,S,178,true,"Col-0 X-ray callus - FC Col-0 vs. Col-0 Xray",111b,31410901,,26.8500000,,-2.2756912,0.0000000,NO,,-0.1038237
DAAVVQVASSEHK,ph,S,178,true,"atm callus - FC atm vs. atm Xray",111c,31410901,,26.8500000,,-0.1532504,0.0000000,NO,,-0.1038237
DAAVVQVASSEHK,ph,S,178,true,"atm-3 X-ray callus - FC atm vs. atm Xray",111d,31410901,,26.8500000,,-0.1532504,0.0000000,NO,,-0.1038237
DAAVVQVASSEHK,ph,S,178,true,"Tissue atlas Arabidopsis - ProteomicsDB",114,32188942,"MaxQuant score",240.4600000,1.0000000,,,,0,
DAAVVQVASSEHKSENNEPFSGLDGGDSK,ph,S,182,true,"Tissue atlas Arabidopsis - ProteomicsDB",114,32188942,"MaxQuant score",186.5000000,0.9357260,,,,0,
SENNEPFSGLDGGDSK,ph,S,189,true,"atm and atr DNA damage response",88,25561503,"MASCOT Score",53.0000000,1.0000000,,,,,-1.5100000
SENNEPFSGLDGGDSK,ph,S,189,true,"Tissue atlas Arabidopsis - ProteomicsDB",114,32188942,"MaxQuant score",150.1100000,0.9995520,,,,3.2897498614126E-10,
SENNEPFSGLDGGDSK,ph,S,196,true,"Tissue atlas Arabidopsis - ProteomicsDB",114,32188942,"MaxQuant score",162.0600000,0.9999980,,,,2.1950299802635E-21,
SDCISTDSVSNNEK,ph,S,231,true,"Large-scale phosphorylation discovery",44,23111157,XCorr,2.9630000,,,,,,
SDCISTDSVSNNEK,ph,S,231,true,"atm and atr DNA damage response",88,25561503,"MASCOT Score",60.0000000,0.9480000,,,,,0.1700000
SDCISTDSVSNNEK,ph,S,231,true,"Tissue atlas Arabidopsis - ProteomicsDB",114,32188942,"MaxQuant score",190.0600000,0.9916180,,,,2.3337700603937E-31,
SDCISTDSVSNNEK,ph,S,234,true,"Large-scale phosphorylation discovery",44,23111157,XCorr,3.2040000,,,,,,
SDCISTDSVSNNEK,ph,S,234,true,"atm and atr DNA damage response",88,25561503,"MASCOT Score",60.0000000,1.0000000,,,,,0.1700000
SDCISTDSVSNNEK,ph,S,234,true,"Tissue atlas Arabidopsis - ProteomicsDB",114,32188942,"MaxQuant score",127.0500000,0.9926900,,,,3.013460082002E-5,
SDCISTDSVSNNEK,ph,S,236,true,"Tissue atlas Arabidopsis - ProteomicsDB",114,32188942,"MaxQuant score",151.0300000,0.9983480,,,,3.9375998121816E-12,
TSVGGGDDSNAANADMIK,ph,S,285,true,"atm and atr DNA damage response",88,25561503,"MASCOT Score",51.0000000,0.9550000,,,,,-0.6100000
TSVGGGDDSNAANADMIK,ph,S,285,true,"Tissue atlas Arabidopsis - ProteomicsDB",114,32188942,"MaxQuant score",222.1100000,0.9345370,,,,0,
TSVGGGDDSNAANADMIKENNIIDAGDSEK,ph,S,292,true,"Tissue atlas Arabidopsis - ProteomicsDB",114,32188942,"MaxQuant score",247.7900000,1.0000000,,,,0,
TSVGGGDDSNAANADMIK,ph,S,292,true,"Tyrosine phosphorylation in Arabidopsis",59,18463617,"MASCOT Score",60.0000000,,,,,,-0.1110051
TSVGGGDDSNAANADMIK,ph,S,292,true,"Conserved plant phosphoproteome - Arabidopsis",61a,20466843,"MASCOT Score",60.0000000,1.0000000,,,,,
TSVGGGDDSNAANADMIK,ph,S,292,true,"atm and atr DNA damage response",88,25561503,"MASCOT Score",45.0000000,1.0000000,,,,,-0.0400000
TSVGGGDDSNAANADMIK,ph,S,292,true,"TOR Kinase and ABA Receptor",100,29290610,XCorr,5.3679295,1.0000000,,,,3.3099999541264E-7,
TSVGGGDDSNAANADMIK,ph,S,292,true,"Lateral root-induction - NAA vs control",106,23328941,"MASCOT Score",32.0000000,,,,,,
TSVGGGDDSNAANADMIK,ph,S,292,true,"Phospho cell culture sucrose/TOR",109,30833711,,,1.0000000,,,,,
ENNIIDAGDSEKLNLDR,ph,S,311,true,"Tissue atlas Arabidopsis - ProteomicsDB",114,32188942,"MaxQuant score",186.6000000,1.0000000,,,,6.7627698397157E-30,
ENNIIDAGDSEK,ph,S,311,true,"Tyrosine phosphorylation in Arabidopsis",59,18463617,"MASCOT Score",53.0000000,,,,,,-0.9396090
ENNIIDAGDSEK,ph,S,311,true,"srk2dei ABA signaling phopshoproteomics",83,23572148,"MASCOT Score",50.0000000,,,,,,-0.0003000
ENNIIDAGDSEK,ph,S,311,true,"TOR Kinase and ABA Receptor",100,29290610,XCorr,2.9496069,1.0000000,,,,0.00013200000103097,
LNLDRSSGDESMEDEPETK,ph,S,319,true,"STN8 phosphoproteome",38,21768351,"MASCOT Score",42.9200000,,,,,,
LNLDRSSGDESMEDEPETK,ph,S,319,true,"Large-scale phosphorylation discovery",44,23111157,XCorr,3.6560000,,,,,,
LNLDRSSGDESMEDEPETK,ph,S,319,true,"Tyrosine phosphorylation in Arabidopsis",59,18463617,"MASCOT Score",49.0000000,,,,,,-2.6895124
LNLDRSSGDESMEDEPETK,ph,S,319,true,"Chloroplast kinase substrates",60,19376835,"MASCOT Score",40.9100000,,,,,,-0.6647380
LNLDRSSGDESMEDEPETK,ph,S,319,true,"srk2dei ABA signaling phopshoproteomics",83,23572148,"MASCOT Score",48.0000000,,,,,,0.0035000
LNLDRSSGDESMEDEPETK,ph,S,319,true,"LAXIC - ABA stress",84a,23660473,XCorr,3.5300000,0.8450000,,,,0.0050941701047122,
LNLDRSSGDESMEDEPETK,ph,S,319,true,"SnRK2 protein kinase substrates",85,23776212,XCorr,3.8774309,1.0000000,,,,0.0019220799440518,
LNLDRSSGDESMEDEPETK,ph,S,319,true,"atm and atr DNA damage response",88,25561503,"MASCOT Score",37.0000000,1.0000000,,,,,-0.2300000
LNLDRSSGDESMEDEPETK,ph,S,319,true,"Brassinosteroid-Regulated Phosphorylation Dynamics",94,26187819,"MaxQuant Score",204.3500000,1.0000000,,,,0,1.6830000
LNLDRSSGDESMEDEPETK,ph,S,319,true,"TOR Kinase and ABA Receptor",100,29290610,XCorr,6.1306782,1.0000000,,,,8.2680002378765E-5,
LNLDRSSGDESMEDEPETK,ph,S,319,true,"Phospho cell culture sucrose/TOR",109,30833711,,,1.0000000,,,,,
SSGDESMEDEPETK,ph,S,319,true,"LAXIC - mannitol vs control",84b,23660473,XCorr,3.9900000,0.9410000,,,,0.0061889300122857,
SSGDESMEDEPETK,ph,S,319,true,"atm and atr DNA damage response",88,25561503,"MASCOT Score",56.0000000,1.0000000,,,,,-2.1200000
SSGDESMEDEPETK,ph,S,319,true,"Tissue atlas Arabidopsis - ProteomicsDB",114,32188942,"MaxQuant score",264.3400000,1.0000000,,,,0,
LNLDRSSGDESMEDEPETK,ph,S,320,true,"Large-scale phosphorylation discovery",44,23111157,XCorr,4.8510000,,,,,,
LNLDRSSGDESMEDEPETK,ph,S,320,true,"Chloroplast kinase substrates",60,19376835,"MASCOT Score",40.9100000,,,,,,-0.6647380
LNLDRSSGDESMEDEPETK,ph,S,320,true,"Conserved plant phosphoproteome - Arabidopsis",61a,20466843,"MASCOT Score",49.0000000,1.0000000,,,,,
LNLDRSSGDESMEDEPETK,ph,S,320,true,"srk2dei ABA signaling phopshoproteomics",83,23572148,"MASCOT Score",48.0000000,,,,,,0.0035000
LNLDRSSGDESMEDEPETK,ph,S,320,true,"SnRK2 protein kinase substrates",85,23776212,XCorr,4.6853113,0.9950000,,,,0.0028286599554121,
LNLDRSSGDESMEDEPETK,ph,S,320,true,"atm and atr DNA damage response",88,25561503,"MASCOT Score",37.0000000,1.0000000,,,,,-0.2300000
LNLDRSSGDESMEDEPETK,ph,S,320,true,"Brassinosteroid-Regulated Phosphorylation Dynamics",94,26187819,"MaxQuant Score",204.3500000,1.0000000,,,,0,1.6830000
LNLDRSSGDESMEDEPETK,ph,S,320,true,"TOR Kinase and ABA Receptor",100,29290610,XCorr,6.1306782,1.0000000,,,,8.2680002378765E-5,
SSGDESMEDEPETK,ph,S,320,true,"Tissue atlas Arabidopsis - ProteomicsDB",114,32188942,"MaxQuant score",264.3400000,1.0000000,,,,0,
LNLDRSSGDESMEDEPETK,ph,S,324,true,"Chloroplast kinase substrates",60,19376835,"MASCOT Score",40.9100000,,,,,,-0.6647380
LNLDRSSGDESMEDEPETK,ph,S,324,true,"srk2dei ABA signaling phopshoproteomics",83,23572148,"MASCOT Score",48.0000000,,,,,,0.0035000
LNLDRSSGDESMEDEPETK,ph,S,324,true,"LAXIC - ABA stress",84a,23660473,XCorr,3.5300000,0.8450000,,,,0.0050941701047122,
LNLDRSSGDESMEDEPETK,ph,S,324,true,"SnRK2 protein kinase substrates",85,23776212,XCorr,4.6853113,1.0000000,,,,0.0028286599554121,
LNLDRSSGDESMEDEPETK,ph,S,324,true,"atm and atr DNA damage response",88,25561503,"MASCOT Score",37.0000000,1.0000000,,,,,-0.2300000
LNLDRSSGDESMEDEPETK,ph,S,324,true,"Brassinosteroid-Regulated Phosphorylation Dynamics",94,26187819,"MaxQuant Score",204.3500000,1.0000000,,,,0,1.6830000
LNLDRSSGDESMEDEPETK,ph,S,324,true,"TOR Kinase and ABA Receptor",100,29290610,XCorr,6.1306782,1.0000000,,,,8.2680002378765E-5,
SSGDESMEDEPETK,ph,S,324,true,"LAXIC - mannitol vs control",84b,23660473,XCorr,3.9900000,1.0000000,,,,0.0061889300122857,
SSGDESMEDEPETK,ph,S,324,true,"SnRK2 protein kinase substrates",85,23776212,XCorr,3.6406021,1.0000000,,,,0.0076558599248528,
SSGDESMEDEPETK,ph,S,324,true,"atm and atr DNA damage response",88,25561503,"MASCOT Score",63.0000000,1.0000000,,,,,-0.1100000
SSGDESMEDEPETK,ph,S,324,true,"TOR Kinase and ABA Receptor",100,29290610,XCorr,4.7181640,0.9998000,,,,3.8569999105675E-7,
SSGDESMEDEPETK,ph,S,324,true,"Lateral root-induction - NAA vs control",106,23328941,"MASCOT Score",31.0000000,,0.0030662,0.9343503,NO,,
SSGDESMEDEPETK,ph,S,324,true,"Tissue atlas Arabidopsis - ProteomicsDB",114,32188942,"MaxQuant score",300.9000000,1.0000000,,,,0,
LNLDRSSGDESMEDEPETK,ph,T,331,true,"srk2dei ABA signaling phopshoproteomics",83,23572148,"MASCOT Score",27.0000000,,,,,,-0.0010000
QSESITSDDKSAK,ph,S,336,true,"Tissue atlas Arabidopsis - ProteomicsDB",114,32188942,"MaxQuant score",171.9300000,1.0000000,,,,2.8503300302565E-15,
QSESITSDDK,ph,S,336,true,"atm and atr DNA damage response",88,25561503,"MASCOT Score",51.0000000,0.9970000,,,,,-0.7500000
QSESITSDDKSAK,ph,T,338,true,"Tissue atlas Arabidopsis - ProteomicsDB",114,32188942,"MaxQuant score",231.3200000,0.9644990,,,,0,
QSESITSDDKSAK,ph,S,339,true,"atm and atr DNA damage response",88,25561503,"MASCOT Score",24.0000000,1.0000000,,,,,1.6500000
QSESITSDDKSAK,ph,S,339,true,"Tissue atlas Arabidopsis - ProteomicsDB",114,32188942,"MaxQuant score",193.9700000,0.9805110,,,,4.0465898379034E-30,
QSESITSDDK,ph,S,339,true,"atm and atr DNA damage response",88,25561503,"MASCOT Score",30.0000000,1.0000000,,,,,-0.7100000
QSESITSDDKSAK,ph,S,343,true,"Tissue atlas Arabidopsis - ProteomicsDB",114,32188942,"MaxQuant score",85.7420000,0.9862530,,,,0.00098560703918338,
IEMLSKEESRADMDAGK,ph,S,354,true,"Tissue atlas Arabidopsis - ProteomicsDB",114,32188942,"MaxQuant score",93.7290000,0.9902270,,,,5.5123900892795E-6,
ADMDAGKGKSPENK,ph,S,365,true,"Tissue atlas Arabidopsis - ProteomicsDB",114,32188942,"MaxQuant score",59.3720000,1.0000000,,,,0.0019923900254071,
SHPLVASDKR,ac,K,378,true,"Quantitative Acetylproteomics",101,29440448,,,,,,,,
KLPANDQEAVGNNEPAKR,ac,K,396,true,"Quantitative Acetylproteomics",101,29440448,,,,,,,,
RWNSNSIK,ph,S,402,true,"Tissue atlas Arabidopsis - ProteomicsDB",114,32188942,"MaxQuant score",155.8300000,0.9985820,,,,0,
WNSNSIKVPEAQITNSATPTTTPR,ph,S,404,true,"Tissue atlas Arabidopsis - ProteomicsDB",114,32188942,"MaxQuant score",204.5000000,0.9275590,,,,0,
WNSNSIK,ph,S,404,true,"TOR Kinase and ABA Receptor",100,29290610,XCorr,2.6456847,0.9952000,,,,0.0036369999870658,
VPEAQITNSATPTTTPR,ph,T,413,true,"srk2dei ABA signaling phopshoproteomics",83,23572148,"MASCOT Score",74.0000000,,,,,,-0.0018000
VPEAQITNSATPTTTPR,ph,T,413,true,"atm and atr DNA damage response",88,25561503,"MASCOT Score",30.0000000,1.0000000,,,,,-0.8600000
VPEAQITNSATPTTTPR,ph,T,413,true,"Lateral root-induction - NAA vs control",106,23328941,"MASCOT Score",45.0000000,,0.1527580,0.5850974,NO,,
VPEAQITNSATPTTTPR,ph,S,415,true,"Conserved plant phosphoproteome - Arabidopsis",61a,20466843,"MASCOT Score",57.0000000,1.0000000,,,,,
VPEAQITNSATPTTTPR,ph,S,415,true,"srk2dei ABA signaling phopshoproteomics",83,23572148,"MASCOT Score",74.0000000,,,,,,-0.0004000
VPEAQITNSATPTTTPR,ph,S,415,true,"LAXIC - ABA stress",84a,23660473,XCorr,4.7200000,0.9250000,,,,3.7199999525228E-8,
VPEAQITNSATPTTTPR,ph,S,415,true,"LAXIC - mannitol vs control",84b,23660473,XCorr,4.5000000,0.9420000,,,,3.8999998650979E-5,
VPEAQITNSATPTTTPR,ph,S,415,true,"SnRK2 protein kinase substrates",85,23776212,XCorr,4.7045031,0.9600000,,,,8.7547799921595E-5,
VPEAQITNSATPTTTPR,ph,S,415,true,"Brassinosteroid-Regulated Phosphorylation Dynamics",94,26187819,"MaxQuant Score",191.2200000,0.8580000,,,,6.7130003492974E-30,0.0300000
VPEAQITNSATPTTTPR,ph,S,415,true,"TOR Kinase and ABA Receptor",100,29290610,XCorr,5.5141907,0.9993000,,,,8.4519999887789E-9,
VPEAQITNSATPTTTPR,ph,S,415,true,"Lateral root-induction - NAA vs control",106,23328941,"MASCOT Score",65.0000000,,0.6599885,0.0081117,YES,,
VPEAQITNSATPTTTPR,ph,S,415,true,"Tissue atlas Arabidopsis - ProteomicsDB",114,32188942,"MaxQuant score",222.9300000,0.9996010,,,,0,
WNSNSIKVPEAQITNSATPTTTPR,ph,T,417,true,"Arabidopsis root NAA phosphoproteome",18a,27643528,"MaxQuant Score",98.2100000,0.8390000,,,,6.9750000046553E-12,-0.2510000
WNSNSIKVPEAQITNSATPTTTPR,ph,T,417,true,"MAPK Arabidopsis substrates",45,23172892,"MaxQuant Score",107.0600000,,,,,,
WNSNSIKVPEAQITNSATPTTTPR,ph,T,417,true,"Col-0 callus - FC Col-0 vs. Col-0 Xray",111a,31410901,,52.1400000,,0.8342331,0.0000000,NO,,0.6592679
WNSNSIKVPEAQITNSATPTTTPR,ph,T,417,true,"Col-0 X-ray callus - FC Col-0 vs. Col-0 Xray",111b,31410901,,52.1400000,,0.8342331,0.0000000,NO,,0.6592679
WNSNSIKVPEAQITNSATPTTTPR,ph,T,417,true,"atm callus - FC atm vs. atm Xray",111c,31410901,,52.1400000,,1.2827485,0.0000000,NO,,0.6592679
WNSNSIKVPEAQITNSATPTTTPR,ph,T,417,true,"atm-3 X-ray callus - FC atm vs. atm Xray",111d,31410901,,52.1400000,,1.2827485,0.0000000,NO,,0.6592679
VPEAQITNSATPTTTPR,ph,T,417,true,"srk2dei ABA signaling phopshoproteomics",83,23572148,"MASCOT Score",84.0000000,,,,,,-0.0003000
VPEAQITNSATPTTTPR,ph,T,417,true,"atm and atr DNA damage response",88,25561503,"MASCOT Score",62.0000000,1.0000000,,,,,0.6200000
VPEAQITNSATPTTTPR,ph,T,417,true,"Brassinosteroid-Regulated Phosphorylation Dynamics",94,26187819,"MaxQuant Score",205.6800000,1.0000000,,,,0,1.2810000
VPEAQITNSATPTTTPR,ph,T,417,true,"TOR Kinase and ABA Receptor",100,29290610,XCorr,5.5141907,0.8617000,,,,8.4519999887789E-9,
VPEAQITNSATPTTTPR,ph,T,417,true,"Lateral root-induction - NAA vs control",106,23328941,"MASCOT Score",47.0000000,,0.2187701,0.4125359,NO,,
VPEAQITNSATPTTTPR,ph,T,417,true,"Phospho cell culture sucrose/TOR",109,30833711,,,0.9967400,,,,,
VPEAQITNSATPTTTPR,ph,T,417,true,"Col-0 callus - FC Col-0 vs. Col-0 Xray",111a,31410901,,85.1300000,,0.1126318,0.0000000,NO,,1.1269240
VPEAQITNSATPTTTPR,ph,T,417,true,"Col-0 X-ray callus - FC Col-0 vs. Col-0 Xray",111b,31410901,,85.1300000,,0.1126318,0.0000000,NO,,1.1269240
VPEAQITNSATPTTTPR,ph,T,417,true,"atm callus - FC atm vs. atm Xray",111c,31410901,,85.1300000,,-0.0026985,0.0000000,NO,,1.1269240
VPEAQITNSATPTTTPR,ph,T,417,true,"atm-3 X-ray callus - FC atm vs. atm Xray",111d,31410901,,85.1300000,,-0.0026985,0.0000000,NO,,1.1269240
VPEAQITNSATPTTTPR,ph,T,417,true,"Tissue atlas Arabidopsis - ProteomicsDB",114,32188942,"MaxQuant score",378.0100000,0.9999850,,,,0,
WNSNSIKVPEAQITNSATPTTTPR,ph,T,419,true,"MAPK Arabidopsis substrates",45,23172892,"MaxQuant Score",55.2080000,,,,,,
WNSNSIKVPEAQITNSATPTTTPR,ph,T,419,true,"Col-0 callus - FC Col-0 vs. Col-0 Xray",111a,31410901,,30.6800000,,0.8489955,0.0000000,NO,,1.2125016
WNSNSIKVPEAQITNSATPTTTPR,ph,T,419,true,"Col-0 X-ray callus - FC Col-0 vs. Col-0 Xray",111b,31410901,,30.6800000,,0.8489955,0.0000000,NO,,1.2125016
WNSNSIKVPEAQITNSATPTTTPR,ph,T,419,true,"atm callus - FC atm vs. atm Xray",111c,31410901,,30.6800000,,0.7213784,0.0000000,NO,,1.2125016
WNSNSIKVPEAQITNSATPTTTPR,ph,T,419,true,"atm-3 X-ray callus - FC atm vs. atm Xray",111d,31410901,,30.6800000,,0.7213784,0.0000000,NO,,1.2125016
VPEAQITNSATPTTTPR,ph,T,419,true,"srk2dei ABA signaling phopshoproteomics",83,23572148,"MASCOT Score",50.0000000,,,,,,0.0000000
VPEAQITNSATPTTTPR,ph,T,419,true,"Brassinosteroid-Regulated Phosphorylation Dynamics",94,26187819,"MaxQuant Score",205.6800000,0.9960000,,,,0,-1.5100000
VPEAQITNSATPTTTPR,ph,T,419,true,"Lateral root-induction - NAA vs control",106,23328941,"MASCOT Score",46.0000000,,0.2723435,0.2976940,NO,,
WNSNSIKVPEAQITNSATPTTTPR,ph,T,420,true,"MAPK Arabidopsis substrates",45,23172892,"MaxQuant Score",99.4070000,,,,,,
VPEAQITNSATPTTTPR,ph,T,420,true,"srk2dei ABA signaling phopshoproteomics",83,23572148,"MASCOT Score",41.0000000,,,,,,-0.0003000
VPEAQITNSATPTTTPR,ph,T,420,true,"Brassinosteroid-Regulated Phosphorylation Dynamics",94,26187819,"MaxQuant Score",191.2200000,0.8440000,,,,2.6540592914312E-41,-0.9080000
VPEAQITNSATPTTTPR,ph,T,420,true,"Lateral root-induction - NAA vs control",106,23328941,"MASCOT Score",61.0000000,,,,,,
VPEAQITNSATPTTTPR,ph,T,420,true,"Col-0 callus - FC Col-0 vs. Col-0 Xray",111a,31410901,,42.3500000,,0.0292854,0.0000000,NO,,0.5507990
VPEAQITNSATPTTTPR,ph,T,420,true,"Col-0 X-ray callus - FC Col-0 vs. Col-0 Xray",111b,31410901,,42.3500000,,0.0292854,0.0000000,NO,,0.5507990
VPEAQITNSATPTTTPR,ph,T,420,true,"atm callus - FC atm vs. atm Xray",111c,31410901,,42.3500000,,-0.5739033,0.0000000,NO,,0.5507990
VPEAQITNSATPTTTPR,ph,T,420,true,"atm-3 X-ray callus - FC atm vs. atm Xray",111d,31410901,,42.3500000,,-0.5739033,0.0000000,NO,,0.5507990
VPEAQITNSATPTTTPR,ph,T,420,true,"Tissue atlas Arabidopsis - ProteomicsDB",114,32188942,"MaxQuant score",370.3500000,0.9142300,,,,0,
WNSNSIKVPEAQITNSATPTTTPR,ph,T,421,true,"MAPK Arabidopsis substrates",45,23172892,"MaxQuant Score",107.0600000,,,,,,
WNSNSIKVPEAQITNSATPTTTPR,ph,T,421,true,"SnRK2 protein kinase substrates",85,23776212,XCorr,3.0951698,0.8420000,,,,0.00014885400014464,
WNSNSIKVPEAQITNSATPTTTPR,ph,T,421,true,"Col-0 callus - FC Col-0 vs. Col-0 Xray",111a,31410901,,53.2900000,,0.5636893,0.0000000,NO,,0.1151328
WNSNSIKVPEAQITNSATPTTTPR,ph,T,421,true,"Col-0 X-ray callus - FC Col-0 vs. Col-0 Xray",111b,31410901,,53.2900000,,0.5636893,0.0000000,NO,,0.1151328
WNSNSIKVPEAQITNSATPTTTPR,ph,T,421,true,"atm callus - FC atm vs. atm Xray",111c,31410901,,53.2900000,,0.0750487,0.0000000,NO,,0.1151328
WNSNSIKVPEAQITNSATPTTTPR,ph,T,421,true,"atm-3 X-ray callus - FC atm vs. atm Xray",111d,31410901,,53.2900000,,0.0750487,0.0000000,NO,,0.1151328
VPEAQITNSATPTTTPR,ph,T,421,true,"Arabidopsis root NAA phosphoproteome",18a,27643528,"MaxQuant Score",98.2100000,0.8410000,,,,6.9750000046553E-12,0.2800000
VPEAQITNSATPTTTPR,ph,T,421,true,"Phosphorylation nuclei-enriched fractions",28,19245862,,,,,,,,
VPEAQITNSATPTTTPR,ph,T,421,true,"Conserved plant phosphoproteome - Arabidopsis",61a,20466843,"MASCOT Score",57.0000000,1.0000000,,,,,
VPEAQITNSATPTTTPR,ph,T,421,true,"srk2dei ABA signaling phopshoproteomics",83,23572148,"MASCOT Score",84.0000000,,,,,,-0.0003000
VPEAQITNSATPTTTPR,ph,T,421,true,"LAXIC - ABA stress",84a,23660473,XCorr,4.7200000,0.9930000,,,,3.7199999525228E-8,
VPEAQITNSATPTTTPR,ph,T,421,true,"LAXIC - mannitol vs control",84b,23660473,XCorr,4.5000000,0.9420000,,,,3.8999998650979E-5,
VPEAQITNSATPTTTPR,ph,T,421,true,"SnRK2 protein kinase substrates",85,23776212,XCorr,4.7045031,0.9980000,,,,8.7547799921595E-5,
VPEAQITNSATPTTTPR,ph,T,421,true,"atm and atr DNA damage response",88,25561503,"MASCOT Score",62.0000000,0.9500000,,,,,0.6200000
VPEAQITNSATPTTTPR,ph,T,421,true,"Brassinosteroid-Regulated Phosphorylation Dynamics",94,26187819,"MaxQuant Score",191.2200000,0.8950000,,,,6.7130003492974E-30,0.0300000
VPEAQITNSATPTTTPR,ph,T,421,true,"TOR Kinase and ABA Receptor",100,29290610,XCorr,5.8873930,0.9402000,,,,2.686000044605E-8,
VPEAQITNSATPTTTPR,ph,T,421,true,"Lateral root-induction - NAA vs control",106,23328941,"MASCOT Score",65.0000000,,0.6599885,0.0081117,YES,,
VPEAQITNSATPTTTPR,ph,T,421,true,"Phospho cell culture sucrose/TOR",109,30833711,,,0.9976560,,,,,
VPEAQITNSATPTTTPR,ph,T,421,true,"Col-0 callus - FC Col-0 vs. Col-0 Xray",111a,31410901,,73.8400000,,0.1194187,0.0000000,NO,,1.2713138