Peptide,PTM,ModifiedAA,ModifiedPosition,PeptideUniqueToGene,ExperimentDesc,ExpID,PubmedID,ScoreType,IdentScore,LocProb,Log2FChange,PQ-val,QuantSig,PEP,MassErrorPPM
FLNVSSNTLDFPGK,ng,N,154,true,"Conserved N-glycosylation",74,22633491,"MaxQuant Score",149.8000000,1.0000000,,,,2.6759998471892E-26,0.8310000
FLNVSSNTLDFPGK,ng,N,154,true,"N-glycan occupancy Arabidopsis glycoproteins",87,23994444,"Ladder score",66.7000000,,,,,,
FLNVSSNTLDFPGK,ng,N,154,true,"ER-associatied N-glycan degradation chilling stres",133,27558752,,,,,,,,
FLNVSSNTLDFPGK,ng,N,154,true,"N-linked Glycan Micro-heterogeneity Arabidopsis",134,29237727,,,,,,,,
FLNVSSNTLDFPGK,ng,N,154,true,"UDP-GlcNAc transporter glycopeptide analysis",135,30224661,,,,,,,5.072533715224E-14,1.6000000
AISTCTELK,sno,C,268,true,"hot5-4 / wildtype, FAT-switch S-nitrosoproteome",169,37277371,,,,-0.0385965,0.7349286,NO,,
LLNISSNQFVGPIPPLPLK,ng,N,275,true,"Conserved N-glycosylation",74,22633491,"MaxQuant Score",153.6800000,0.9840000,,,,1.5899999606083E-32,0.0340000
LLNISSNQFVGPIPPLPLK,ng,N,275,true,"ER-associatied N-glycan degradation chilling stres",133,27558752,,,,,,,,
LLNISSNQFVGPIPPLPLK,ng,N,275,true,"UDP-GlcNAc transporter glycopeptide analysis",135,30224661,,,,,,,1.8930553739166E-12,1.2000000
LSNNSFSGNIPAELGDCR,ng,N,545,true,"Conserved N-glycosylation",74,22633491,"MaxQuant Score",191.2000000,1.0000000,,,,0,0.3280000
LSNNSFSGNIPAELGDCR,ng,N,545,true,"ER-associatied N-glycan degradation chilling stres",133,27558752,,,,,,,,
NPCNITSR,ng,N,636,true,"Conserved N-glycosylation",74,22633491,"MaxQuant Score",110.5200000,1.0000000,,,,0.0070000002160668,2.2680000
EAELEMYAEGHGNSGDR,ph,S,838,true,"atm and atr DNA damage response",88,25561503,"MASCOT Score",82.0000000,1.0000000,,,,,0.0500000
EAELEMYAEGHGNSGDR,ph,S,838,true,"Phosphorylation tonoplast membrane fraction",107,18686298,"MASCOT Score",96.0000000,,,,,,
EAELEMYAEGHGNSGDR,ph,S,838,true,"Tissue atlas Arabidopsis - ProteomicsDB",114,32188942,"MaxQuant score",173.6500000,1.0000000,,,,5.8559297007105E-23,
LIHVSGQGDR,ph,S,917,true,"atm and atr DNA damage response",88,25561503,"MASCOT Score",39.0000000,1.0000000,,,,,0.3400000
LIHVSGQGDR,ph,S,917,true,"Tissue atlas Arabidopsis - ProteomicsDB",114,32188942,"MaxQuant score",110.8000000,1.0000000,,,,5.5678501666989E-5,
EIQAGSGIDSQSTIR,ph,S,1166,true,"Tissue atlas Arabidopsis - ProteomicsDB",114,32188942,"MaxQuant score",138.9800000,0.8754690,,,,6.1579197563333E-7,
