Peptide,PTM,ModifiedAA,ModifiedPosition,PeptideUniqueToGene,ExperimentDesc,ExpID,PubmedID,ScoreType,IdentScore,LocProb,Log2FChange,PQ-val,QuantSig,PEP,MassErrorPPM
MNTGGRLIAGSHNRNE,nta,M,1,false,"Arg/N-end rule seed, prt6 vs. Wt",99,29168982,"MASCOT Score",32.1000000,,,,,1.8610000552144E-5,-0.0706464
MNTGGRLIAGSHNRNE,nta,M,1,false,"HUNTER N-terminome: legumain, GluC and trypsin",119,31951383,"MaxQuant score",110.7400000,,,,,,
LIAGSHNR,ph,S,11,false,"atm and atr DNA damage response",88,25561503,"MASCOT Score",41.0000000,1.0000000,,,,,-0.5000000
HALIVPPSTGYGNR,ph,S,172,true,"Tissue atlas Arabidopsis - ProteomicsDB",114,32188942,"MaxQuant score",65.7160000,0.8288450,,,,0.00057245302014053,
NKVHPAFVR,ub,K,445,false,"Ubiquitination Membrane Proteins",120,33585938,,,,,,,,
NKVHPAFVR,ub,K,445,false,"upl3 mutant / wildtype",168,35926874,"MaxQuant score",50.0400000,1.0000000,0.2654369,,,0.017961399629712,-0.0346000
INALVATAQKVPEEGWTMQDGTPWPGNNVR,ub,K,477,false,"upl3 mutant / wildtype",168,35926874,"MaxQuant score",75.6610000,1.0000000,-0.1250064,,,8.2962199610126E-11,-1.1852000
KTCNCWPK,acy,C,659,false,"Arabidopsis S-acylation atlas - Meristem",163a,35681017,,,,,,,,
TCNCWPK,acy,C,659,false,"Arabidopsis S-acylation atlas - Meristem",163a,35681017,,,,,,,,
KTCNCWPK,acy,C,661,false,"Arabidopsis S-acylation atlas - Meristem",163a,35681017,,,,,,,,
TCNCWPK,acy,C,661,false,"Arabidopsis S-acylation atlas - Meristem",163a,35681017,,,,,,,,
WCCLCCGLR,acy,C,666,true,"Arabidopsis S-acylation atlas - Silique",163e,35681017,,,,,,,,
WCCLCCGLR,acy,C,667,true,"Arabidopsis S-acylation atlas - Silique",163e,35681017,,,,,,,,
WCCLCCGLR,acy,C,669,true,"Arabidopsis S-acylation atlas - Silique",163e,35681017,,,,,,,,
WCCLCCGLR,acy,C,670,true,"Arabidopsis S-acylation atlas - Silique",163e,35681017,,,,,,,,
NASPACLLR,acy,C,751,true,"Arabidopsis S-acylation atlas - Hypocotyl",163b,35681017,,,,,,,,
NASPACLLR,acy,C,751,true,"Arabidopsis S-acylation atlas - Silique",163e,35681017,,,,,,,,
GGPVLEICGLNCGN,acy,C,1078,true,"Arabidopsis S-acylation atlas - Silique",163e,35681017,,,,,,,,
GGPVLEICGLNCGN,acy,C,1082,true,"Arabidopsis S-acylation atlas - Silique",163e,35681017,,,,,,,,
