Peptide,PTM,ModifiedAA,ModifiedPosition,PeptideUniqueToGene,ExperimentDesc,ExpID,PubmedID,ScoreType,IdentScore,LocProb,Log2FChange,PQ-val,QuantSig,PEP,MassErrorPPM
AKSPETEHPNKVFGWGAR,nt,A,2,true,"Stromal N-terminome",96,26371235,"MASCOT Score",35.1700000,,,,,,
AKSPETEHPNKVFGWGAR,nt,A,2,true,"FtsH12 N-terminome: WT / FtsH12 knockdown miRNA",118,33216923,"MaxQuant score",64.8780000,,-0.8067636,0.0492473,YES,0.015460000373423,
AKSPETEHPNKVF,nt,A,2,true,"Arg/N-end rule seed, prt6 vs. Wt",99,29168982,"MASCOT Score",27.6500000,,,,,0.012109999544919,-1.5240275
AKSPETEHPN,nt,A,2,true,"N-terminal ChaFRADIC",92,26010716,"MASCOT Score",37.1700000,,,,,0.0006633999873884,
AKSPETEHPN,nt,A,2,true,"Arg/N-end rule seed, prt6 vs. Wt",99,29168982,"MASCOT Score",36.1100000,,,,,0.038059998303652,-0.4362599
AKSPETEHPNKVFGWGAR,nta,A,2,true,"Stromal N-terminome",96,26371235,"MASCOT Score",35.1700000,,,,,,
AKSPETEHPNKVFGWGAR,nta,A,2,true,"HUNTER N-terminome: legumain, GluC and trypsin",119,31951383,"MaxQuant score",50.8310000,,,,,,
AKSPETEHPNKVF,nta,A,2,true,"Arg/N-end rule seed, prt6 vs. Wt",99,29168982,"MASCOT Score",27.6500000,,-0.0618584,0.4230150,NO,0.012109999544919,-1.5240275
AKSPETEHPN,nta,A,2,true,"N-terminal ChaFRADIC",92,26010716,"MASCOT Score",37.1700000,,,,,0.0006633999873884,
AKSPETEHPN,nta,A,2,true,"Arg/N-end rule seed, prt6 vs. Wt",99,29168982,"MASCOT Score",36.1100000,,-0.0861368,0.6465816,NO,0.038059998303652,-0.4362599
AKSPETEHPNK,ph,S,4,true,"atm and atr DNA damage response",88,25561503,"MASCOT Score",48.0000000,0.9990000,,,,,-0.8600000
AKSPETEHPNK,ph,S,4,true,"Protein sumoylation and phosphorylation cross-talk",97,28419593,,,,,,,,
AKSPETEHPNK,ph,S,4,true,"Tissue atlas Arabidopsis - ProteomicsDB",114,32188942,"MaxQuant score",209.5300000,1.0000000,,,,3.3146999950867E-36,
SPETEHPNK,ph,S,4,true,"atm and atr DNA damage response",88,25561503,"MASCOT Score",51.0000000,1.0000000,,,,,-0.7200000
DKSGVLSPFHFSR,ph,S,22,true,"atm and atr DNA damage response",88,25561503,"MASCOT Score",47.0000000,1.0000000,,,,,-0.4300000
DKSGVLSPFHFSR,ph,S,22,true,"Tissue atlas Arabidopsis - ProteomicsDB",114,32188942,"MaxQuant score",121.2600000,0.9999660,,,,1.6953799786279E-5,
SGVLSPFHFSR,ph,S,22,false,"TOR Kinase and ABA Receptor",100,29290610,XCorr,2.7378979,1.0000000,,,,0.0031679999083281,
DKSGVLSPFHFSR,ph,S,26,true,"atm and atr DNA damage response",88,25561503,"MASCOT Score",38.0000000,1.0000000,,,,,0.3600000
SGVLSPFHFSR,ph,S,26,false,"atm and atr DNA damage response",88,25561503,"MASCOT Score",55.0000000,1.0000000,,,,,-0.3300000
SGVLSPFHFSR,ph,S,26,false,"Tissue atlas Arabidopsis - ProteomicsDB",114,32188942,"MaxQuant score",226.5300000,1.0000000,,,,7.1284052880203E-42,
SGVLSPFHFSRR,ph,S,31,false,"Tissue atlas Arabidopsis - ProteomicsDB",114,32188942,"MaxQuant score",65.9430000,0.9969480,,,,0.001437840051949,
SENIVVDQ,nt,S,139,true,"N-terminal ChaFRADIC",92,26010716,"MASCOT Score",62.5900000,,,,,0.00012209999840707,
YYGMTEAGK,mox,M,180,true,"cat2 Methionine oxidation - 1h stress",62a,25693801,"MASCOT Score",38.0000000,,-0.5985778,,NO,,
YYGMTEAGK,mox,M,180,true,"cat2 Methionine oxidation - 3h stress",62b,25693801,"MASCOT Score",35.0000000,,-0.2136766,,NO,,
GKLIALGLPE,nt,G,272,true,"Arg/N-end rule seed, prt6 vs. Wt",99,29168982,"MASCOT Score",20.3600000,,-0.0820771,0.7300457,NO,0.038229998201132,-3.5871605
MVGGSDVGGMK,mox,M,297,true,"cat2 Methionine oxidation - 1h stress",62a,25693801,"MASCOT Score",56.0000000,,0.0664786,,NO,,
MVGGSDVGGMK,mox,M,297,true,"cat2 Methionine oxidation - 3h stress",62b,25693801,"MASCOT Score",81.0000000,,0.2070671,,NO,,
MVGGSDVGGMK,mox,M,306,true,"cat2 Methionine oxidation - 1h stress",62a,25693801,"MASCOT Score",56.0000000,,0.0664786,,NO,,
MVGGSDVGGMK,mox,M,306,true,"cat2 Methionine oxidation - 3h stress",62b,25693801,"MASCOT Score",81.0000000,,0.2070671,,NO,,
FVIDVANSLSPP,ph,S,358,true,"atm and atr DNA damage response",88,25561503,"MASCOT Score",27.0000000,1.0000000,,,,,-1.4700000
