Peptide,PTM,ModifiedAA,ModifiedPosition,PeptideUniqueToGene,ExperimentDesc,ExpID,PubmedID,ScoreType,IdentScore,LocProb,Log2FChange,PQ-val,QuantSig,PEP,MassErrorPPM
VKESEYYDILGVKID,nt,V,2,true,"HUNTER N-terminome: legumain, GluC and trypsin",119,31951383,"MaxQuant score",86.3900000,,,,,,
QVHPDKNPGDPQAAKNFQILGEAYQVLGDPEKR,nt,Q,32,true,"HUNTER N-terminome: legumain, GluC and trypsin",119,31951383,"MaxQuant score",54.5830000,,,,,,
VCQAVLKDPSVSK,sno,C,284,true,"Site-specific nitrosomeproteomic id - gsnor1-3",90b,25699590,XCorr,3.0100000,,,,,0.00045930000487715,-7.3900000
AYSRENSLR,ph,S,320,true,"atm and atr DNA damage response",88,25561503,"MASCOT Score",20.0000000,0.9940000,,,,,-1.1800000
AYSRENSLR,ph,S,320,true,"Tissue atlas Arabidopsis - ProteomicsDB",114,32188942,"MaxQuant score",68.4400000,0.9987290,,,,0.0030822199769318,
ENSLRHEEETGVK,ph,S,324,true,"Phosphoproteome iron-deficient Arabidopsis roots",41,22438062,"MASCOT Score",43.5000000,,,,,,
ENSLRHEEETGVK,ph,S,324,true,"Tyrosine phosphorylation in Arabidopsis",59,18463617,"MASCOT Score",26.0000000,,,,,,-0.6223946
ENSLRHEEETGVK,ph,S,324,true,"atm and atr DNA damage response",88,25561503,"MASCOT Score",52.0000000,1.0000000,,,,,0.4700000
ENSLRHEEETGVK,ph,S,324,true,"Phospho cell culture sucrose/TOR",109,30833711,,,1.0000000,,,,,
ENSLRHEEETGVK,ph,S,324,true,"Tissue atlas Arabidopsis - ProteomicsDB",114,32188942,"MaxQuant score",167.1800000,1.0000000,,,,1.7400300315122E-15,
AYSRENSLRHEEETGVK,ph,T,331,true,"TOR Kinase and ABA Receptor",100,29290610,XCorr,2.8345432,0.9895000,,,,0.098279997706413,
VHTGDSSKPAT,ph,S,340,true,"Tissue atlas Arabidopsis - ProteomicsDB",114,32188942,"MaxQuant score",162.6500000,0.9908730,,,,1.4072300269508E-10,
