Peptide,PTM,ModifiedAA,ModifiedPosition,PeptideUniqueToGene,ExperimentDesc,ExpID,PubmedID,ScoreType,IdentScore,LocProb,Log2FChange,PQ-val,QuantSig,PEP,MassErrorPPM
SNIRHSPSWSFR,ph,S,32,true,"Tissue atlas Arabidopsis - ProteomicsDB",114,32188942,"MaxQuant score",79.3260000,0.9981970,,,,0.00040533501305617,
SPASDLSFPR,ph,S,92,true,"STN8 phosphoproteome",38,21768351,"MASCOT Score",42.0900000,,,,,,0.1957800
SPASDLSFPR,ph,S,92,true,"atm and atr DNA damage response",88,25561503,"MASCOT Score",41.0000000,1.0000000,,,,,-0.1200000
SPASDLSFPR,ph,S,92,true,"TOR Kinase and ABA Receptor",100,29290610,XCorr,2.5617137,0.9992000,,,,0.0012850000057369,
SPASDLSFPR,ph,S,92,true,"Tissue atlas Arabidopsis - ProteomicsDB",114,32188942,"MaxQuant score",143.0000000,0.9999640,,,,2.3784701040769E-16,
NSSMNTVFEQK,ph,S,104,true,"Tissue atlas Arabidopsis - ProteomicsDB",114,32188942,"MaxQuant score",92.1900000,0.9975030,,,,8.7099499069154E-5,
QVSDGQIYGQNSLSR,ph,S,173,true,"Tissue atlas Arabidopsis - ProteomicsDB",114,32188942,"MaxQuant score",291.0200000,1.0000000,,,,0,
QVSDGQIYGQNSLSR,ph,S,182,true,"Tissue atlas Arabidopsis - ProteomicsDB",114,32188942,"MaxQuant score",199.6100000,0.9331390,,,,7.6304500896774E-35,
TAAAASKSPR,ph,S,377,true,"atm and atr DNA damage response",88,25561503,"MASCOT Score",43.0000000,1.0000000,,,,,-0.9700000
LVSSSSAK,ph,S,382,true,"atm and atr DNA damage response",88,25561503,"MASCOT Score",22.0000000,0.9810000,,,,,-2.6600000
HFSFGSR,ph,S,400,false,"TOR Kinase and ABA Receptor",100,29290610,XCorr,2.6558123,0.9231000,,,,0.014109999872744,
HFSFGSR,ph,S,400,false,"Tissue atlas Arabidopsis - ProteomicsDB",114,32188942,"MaxQuant score",181.4100000,1.0000000,,,,6.3816000874795E-6,
SNYKSPKENLPVK,ph,S,409,true,"Tissue atlas Arabidopsis - ProteomicsDB",114,32188942,"MaxQuant score",74.7320000,0.9991660,,,,0.00052247202256694,
