Peptide,PTM,ModifiedAA,ModifiedPosition,PeptideUniqueToGene,ExperimentDesc,ExpID,PubmedID,ScoreType,IdentScore,LocProb,Log2FChange,PQ-val,QuantSig,PEP,MassErrorPPM
SDVNDGDDLVIRQVVGGAEPQVLTSE,nt,S,23,true,"HUNTER N-terminome: legumain, GluC and trypsin",119,31951383,"MaxQuant score",66.8530000,,,,,,
SDVNDGDDLVIR,nt,S,23,true,"Arg/N-end rule pathway Roots",80,25728785,"MASCOT Score",65.9800000,,,,,7.7639997471124E-5,
SDVNDGDDLVIR,nt,S,23,true,"N-terminal ChaFRADIC",92,26010716,"MASCOT Score",57.9100000,,,,,5.2700001106132E-5,
SDVNDGDDLVIR,nt,S,23,true,"Arg/N-end rule seed, prt6 vs. Wt",99,29168982,"MASCOT Score",77.8800000,,-0.3425372,0.0148802,NO,0.00014829999417998,-1.9988738
SDVNDGDDLVIR,nt,S,23,true,"FtsH12 N-terminome: WT / FtsH12 knockdown miRNA",118,33216923,"MaxQuant score",118.5100000,,0.0051510,0.9540413,NO,0,
SDVNDGDDLVIR,nt,S,23,true,"HUNTER N-terminome: legumain, GluC and trypsin",119,31951383,"MaxQuant score",65.5000000,,,,,,
LPKDANKAPILPTENLPEDFDWR,nt,L,120,true,"Arg/N-end rule pathway Roots",80,25728785,"MASCOT Score",52.8600000,,,,,5.111000064062E-5,
LPKDANKAPILPTENLPEDFDWR,nt,L,120,true,"FtsH12 N-terminome: WT / FtsH12 knockdown miRNA",118,33216923,"MaxQuant score",179.9500000,,-0.6735863,0.0011768,YES,3.6500000714739E-15,
DANKAPILPTENLPEDFDWR,nt,D,123,true,"Arg/N-end rule pathway Roots",80,25728785,"MASCOT Score",42.1200000,,,,,0.00027590000536293,
DANKAPILPTENLPEDFDWR,nt,D,123,true,"HUNTER N-terminome: legumain, GluC and trypsin",119,31951383,"MaxQuant score",77.6810000,,,,,,
DANKAPILPTENLPE,nt,D,123,true,"N-terminal ChaFRADIC",92,26010716,"MASCOT Score",20.0900000,,,,,0.0029319999739528,
DANKAPILPTENLPE,nt,D,123,true,"Arg/N-end rule seed, prt6 vs. Wt",99,29168982,"MASCOT Score",38.0800000,,-0.7773694,0.0000081,NO,0.00033730000723153,-1.5958647
DANKAPILPTENLPE,nt,D,123,true,"HUNTER N-terminome: legumain, GluC and trypsin",119,31951383,"MaxQuant score",69.2610000,,,,,,
DANKAPILPTE,nt,D,123,true,"Arg/N-end rule seed, prt6 vs. Wt",99,29168982,"MASCOT Score",38.5800000,,-0.9428044,0.0024203,NO,0.00083500001346692,-2.1330778
IVASVSNFSVISIDEEQIAANLVK,ng,N,253,true,"Conserved N-glycosylation",74,22633491,"MaxQuant Score",251.3000000,1.0000000,,,,0,0.9780000
IVASVSNFSVISIDEEQIAANLVK,ng,N,253,true,"ER-associatied N-glycan degradation chilling stres",133,27558752,,,,,,,,
IVASVSNFSVISIDEEQIAANLVK,ng,N,253,true,"N-linked Glycan Micro-heterogeneity Arabidopsis",134,29237727,,,,,,,,
IVASVSNFSVISIDEEQIAANLVK,ng,N,253,true,"UDP-GlcNAc transporter glycopeptide analysis",135,30224661,,,,,,,3.3798880361147E-11,2.5000000
AAGYAPAR,nt,A,311,true,"Arg/N-end rule seed, prt6 vs. Wt",99,29168982,"MASCOT Score",31.4400000,,-1.0106516,0.0083405,YES,0.21819999814034,0.1068678
