Peptide,PTM,ModifiedAA,ModifiedPosition,PeptideUniqueToGene,ExperimentDesc,ExpID,PubmedID,ScoreType,IdentScore,LocProb,Log2FChange,PQ-val,QuantSig,PEP,MassErrorPPM
AESGGGGGCCPPMDLMR,nt,A,2,true,"FtsH12 N-terminome: WT / FtsH12 knockdown miRNA",118,33216923,"MaxQuant score",57.2380000,,,,,0.0017500000540167,
AESGGGGGCCPPMDLMR,nta,A,2,true,"Characterization plant N-terminal acetylation",6,22223895,"MASCOT Score",82.7600000,,,,,,
AESGGGGGCCPPMDLMR,nta,A,2,true,"FtsH12 N-terminome: WT / FtsH12 knockdown miRNA",118,33216923,"MaxQuant score",95.4280000,,,,,0.00056517997290939,
AESGGGGGCCPPMDLMR,nta,A,2,true,"HUNTER N-terminome: legumain, GluC and trypsin",119,31951383,"MaxQuant score",184.2100000,,,,,,
DLNSEKSPFQR,ph,S,57,false,"Tissue atlas Arabidopsis - ProteomicsDB",114,32188942,"MaxQuant score",113.7600000,0.9999730,,,,5.7134799135383E-5,
TYAAQIKR,ac,K,68,false,"Quantitative Acetylproteomics",101,29440448,,,,,,,,
TYAAQIKR,ub,K,68,false,"Ubiquitination Membrane Proteins",120,33585938,,,,,,,,
CGEMAR,sno,C,70,false,"hot5-4 / wildtype, FAT-switch S-nitrosoproteome",169,37277371,,,,,,,,
EMQGKENDIDLDDVEVK,ub,K,97,true,"upl3 mutant / wildtype",168,35926874,"MaxQuant score",86.3670000,1.0000000,-0.2276920,0.7603600,NO,8.4450499571176E-7,-1.8653000
LGELEAELVEINANNDKLQR,ub,K,126,true,"Ubiquitination Membrane Proteins",120,33585938,,,,,,,,
LGELEAELVEINANNDKLQR,ub,K,126,true,"upl3 mutant / wildtype",168,35926874,"MaxQuant score",196.7100000,1.0000000,0.6843699,0.3661800,NO,6.1252437433795E-40,-0.8406000
QQRETESQQAGEDLLESPLLQEEKSID,nt,Q,158,true,"HUNTER N-terminome: legumain, GluC and trypsin",119,31951383,"MaxQuant score",,,,,,,
SQQAGEDLLE,nt,S,164,true,"N-terminal ChaFRADIC",92,26010716,"MASCOT Score",36.8600000,,,,,0.0016250000335276,
ETESQQAGEDLLESPLLQEEK,ph,S,164,true,"Col-0 callus - FC Col-0 vs. Col-0 Xray",111a,31410901,,84.8900000,,0.7000673,0.0000000,NO,,0.4827394
ETESQQAGEDLLESPLLQEEK,ph,S,164,true,"Col-0 X-ray callus - FC Col-0 vs. Col-0 Xray",111b,31410901,,84.8900000,,0.7000673,0.0000000,NO,,0.4827394
ETESQQAGEDLLESPLLQEEK,ph,S,164,true,"atm callus - FC atm vs. atm Xray",111c,31410901,,84.8900000,,1.1856543,0.0000000,NO,,0.4827394
ETESQQAGEDLLESPLLQEEK,ph,S,164,true,"atm-3 X-ray callus - FC atm vs. atm Xray",111d,31410901,,84.8900000,,1.1856543,0.0000000,NO,,0.4827394
ETESQQAGEDLLESPLLQEEK,ph,S,174,true,"Phytohormone-responsive phosphoproteins",34,20374526,"MASCOT Score",56.0000000,,,,,,0.5116210
ETESQQAGEDLLESPLLQEEK,ph,S,174,true,"STN8 phosphoproteome",38,21768351,"MASCOT Score",69.2300000,,,,,,-0.8691720
ETESQQAGEDLLESPLLQEEK,ph,S,174,true,"Chloroplast kinase substrates",60,19376835,"MASCOT Score",59.8100000,,,,,,-0.8691720
ETESQQAGEDLLESPLLQEEK,ph,S,174,true,"TOR Kinase and ABA Receptor",100,29290610,XCorr,5.2385035,1.0000000,,,,2.1789999493649E-7,
ETESQQAGEDLLESPLLQEEK,ph,S,174,true,"Tissue atlas Arabidopsis - ProteomicsDB",114,32188942,"MaxQuant score",414.4500000,1.0000000,,,,0,
ETESQQAGEDLLESPLLQEEKSIDSTK,ub,K,181,true,"Ubiquitination Membrane Proteins",120,33585938,,,,,,,,
ETESQQAGEDLLESPLLQEEKSIDSTK,ub,K,181,true,"upl3 mutant / wildtype",168,35926874,"MaxQuant score",165.4700000,1.0000000,-0.1440103,0.3801200,NO,1.7249499807089E-37,-0.1407900
SIDSTKQVK,ub,K,187,true,"Ubiquitination Membrane Proteins",120,33585938,,,,,,,,
QVKLGFLTGLVPR,ub,K,190,false,"Ubiquitination Membrane Proteins",120,33585938,,,,,,,,
ILKICEAFGANR,ub,K,258,false,"upl3 mutant / wildtype",168,35926874,"MaxQuant score",106.2600000,1.0000000,-0.5104571,0.3333000,NO,3.88100015698E-5,-0.6159500
NILLQTIGDKFELWNLK,ub,K,312,true,"upl3 mutant / wildtype",168,35926874,"MaxQuant score",102.2900000,1.0000000,,,,1.0633500302504E-8,1.6099000
AIYHTLNMLSLDVTKK,ub,K,339,false,"Ubiquitination Membrane Proteins",120,33585938,,,,,,,,
KCLVAEGWSPVFASR,ub,K,340,true,"upl3 mutant / wildtype",168,35926874,"MaxQuant score",42.3140000,1.0000000,,,,0.0030446900054812,-0.0791740
DVSCSEATTIGLIK,sno,C,509,false,"hot5-4 / wildtype, FAT-switch S-nitrosoproteome",169,37277371,,,,-0.0497837,0.7050654,NO,,
