Peptide,PTM,ModifiedAA,ModifiedPosition,PeptideUniqueToGene,ExperimentDesc,ExpID,PubmedID,ScoreType,IdentScore,LocProb,Log2FChange,PQ-val,QuantSig,PEP,MassErrorPPM
TRSSRPPSPASSTSSSHLSNR,ph,S,10,true,"TOR Kinase and ABA Receptor",100,29290610,XCorr,4.1342750,0.8570000,,,,0.00082650000695139,
TRSSRPPSPASSTSSSHLSNR,ph,S,11,true,"TOR Kinase and ABA Receptor",100,29290610,XCorr,4.1342750,0.9474000,,,,0.00082650000695139,
SSRPPSPASSTSSSHLSNR,ph,S,11,true,"atm and atr DNA damage response",88,25561503,"MASCOT Score",39.0000000,0.9390000,,,,,0.4500000
SSRPPSPASSTSSSHLSNR,ph,S,15,true,"atm and atr DNA damage response",88,25561503,"MASCOT Score",39.0000000,1.0000000,,,,,0.4500000
SSRPPSPASSTSSSHLSNR,ph,S,15,true,"TOR Kinase and ABA Receptor",100,29290610,XCorr,4.9439769,0.9702000,,,,1.2409999499141E-6,
SSRPPSPASSTSSSHLSNR,ph,S,15,true,"Tissue atlas Arabidopsis - ProteomicsDB",114,32188942,"MaxQuant score",152.4000000,0.9999340,,,,6.7893500923129E-19,
SNSTSASSLITSAAGIASR,ph,S,33,true,"Large-scale phosphorylation discovery",44,23111157,XCorr,6.1090000,,,,,,
SNSTSASSLITSAAGIASR,ph,S,33,true,"TOR Kinase and ABA Receptor",100,29290610,XCorr,5.2870488,0.8992000,,,,3.1380000820036E-9,
SNSTSASSLITSAAGIASR,ph,S,35,true,"Tissue atlas Arabidopsis - ProteomicsDB",114,32188942,"MaxQuant score",234.2200000,0.9793290,,,,0,
EISTLKLELDQLR,ph,S,439,true,"Tissue atlas Arabidopsis - ProteomicsDB",114,32188942,"MaxQuant score",116.0600000,0.8342920,,,,2.2286500097835E-5,
SLSAGKDDKFDSLLLESDNLGSPSSTLALLSEGSLGFNHR,ph,S,523,true,"Tissue atlas Arabidopsis - ProteomicsDB",114,32188942,"MaxQuant score",133.3700000,0.8138500,,,,0,
LNDENSPGAEFTQGVMTPDEIDLLVEQVK,ph,S,571,true,"SnRK2 protein kinase substrates",85,23776212,XCorr,3.6664739,0.7690000,,,,3.7250299556035E-6,
LNDENSPGAEFTQGVMTPDEIDLLVEQVK,ph,S,571,true,"TOR Kinase and ABA Receptor",100,29290610,XCorr,6.7268028,0.9975000,,,,1.3990000269359E-8,
LNAVSSEKSSPSCSNK,ph,S,720,true,"Tissue atlas Arabidopsis - ProteomicsDB",114,32188942,"MaxQuant score",73.6220000,0.8819020,,,,0.00033291001454927,
LNAVSSEKSSPSCSNK,ph,S,723,true,"Large-scale phosphorylation discovery",44,23111157,XCorr,3.7240000,,,,,,
LNAVSSEKSSPSCSNK,ph,S,723,true,"Tissue atlas Arabidopsis - ProteomicsDB",114,32188942,"MaxQuant score",139.5100000,0.8543950,,,,5.5800599696454E-9,
LNAVSSEKSSPSCSNK,ph,S,724,true,"Large-scale phosphorylation discovery",44,23111157,XCorr,4.2290000,,,,,,
LNAVSSEKSSPSCSNK,ph,S,724,true,"Tissue atlas Arabidopsis - ProteomicsDB",114,32188942,"MaxQuant score",204.4300000,0.9899420,,,,0,
SSPSCSNK,ph,S,724,true,"atm and atr DNA damage response",88,25561503,"MASCOT Score",27.0000000,0.9310000,,,,,-1.4300000
SSGDEFDAWNLDPEDLK,ph,S,851,true,"SnRK2 protein kinase substrates",85,23776212,XCorr,2.9020240,0.9530000,,,,3.6021399751895E-10,
ISSSRSSGDEFDAWNLDPEDLK,ph,S,852,true,"TOR Kinase and ABA Receptor",100,29290610,XCorr,4.0544767,0.7729000,,,,3.9359998481814E-5,
SSGDEFDAWNLDPEDLK,ph,S,852,true,"Lateral root-induction - NAA vs control",106,23328941,"MASCOT Score",45.0000000,,,,,,
