Peptide,PTM,ModifiedAA,ModifiedPosition,PeptideUniqueToGene,ExperimentDesc,ExpID,PubmedID,ScoreType,IdentScore,LocProb,Log2FChange,PQ-val,QuantSig,PEP,MassErrorPPM
ASTSLLKASPVLDKSEWVKGQSVLFR,nt,A,2,true,"Stromal N-terminome",96,26371235,"MASCOT Score",35.9900000,,,,,,
ASTSLLKASP,nt,A,2,true,"N-term acetylation drought responses",5,26184543,,,,,,,,
ASTSLLKASPVLDKSEWVKGQSVLFR,nta,A,2,true,"Stromal N-terminome",96,26371235,"MASCOT Score",35.9900000,,,,,,
QPSSASVVLR,ph,S,30,true,"atm and atr DNA damage response",88,25561503,"MASCOT Score",21.0000000,0.9930000,,,,,-0.2500000
QPSSASVVLR,ph,S,30,true,"Tissue atlas Arabidopsis - ProteomicsDB",114,32188942,"MaxQuant score",69.7210000,0.9317370,,,,0.0063097001984715,
AASSYADELVKTAKTIASPGR,nt,A,47,true,"Stromal N-terminome",96,26371235,"MASCOT Score",74.6300000,,,,,,
AASSYADELVKTAKTIASPGR,nt,A,47,true,"HUNTER N-terminome: legumain, GluC and trypsin",119,31951383,"MaxQuant score",46.1780000,,,,,,
AASSYADELVKTAK,nt,A,47,true,"Stromal N-terminome",96,26371235,"MASCOT Score",71.5200000,,,,,,
AASSYADE,nt,A,47,true,"N-terminal ChaFRADIC",92,26010716,"MASCOT Score",63.3900000,,,,,0.012350000441074,
AASSYADE,nt,A,47,true,"Arg/N-end rule seed, prt6 vs. Wt",99,29168982,"MASCOT Score",65.0900000,,-0.0896359,0.5636331,NO,0.0042719999328256,0.4664333
ASSYADELVKTAKTIASPGRGILAMDESN,nt,A,48,true,"HUNTER N-terminome: legumain, GluC and trypsin",119,31951383,"MaxQuant score",141.3800000,,,,,,
ASSYADELVKTAKTIASPGR,nt,A,48,true,"Stromal N-terminome",96,26371235,"MASCOT Score",106.6100000,,,,,,
ASSYADELVKTAKTIASPGR,nt,A,48,true,"FtsH12 N-terminome: WT / FtsH12 knockdown miRNA",118,33216923,"MaxQuant score",158.3000000,,-0.2836436,0.1210708,NO,0,
ASSYADELVKTAKTIASPGR,nt,A,48,true,"HUNTER N-terminome: legumain, GluC and trypsin",119,31951383,"MaxQuant score",278.8500000,,,,,,
ASSYADELVKTAKTIASPGR,nt,A,48,true,"Arabidopsis translation initiation landscape - NT",167b,35069635,,,,,,,,
ASSYADELVKTA,nt,A,48,true,"N-terminal ChaFRADIC",92,26010716,"MASCOT Score",38.6600000,,,,,7.1110001442776E-8,
ASSYADE,nt,A,48,true,"N-terminal ChaFRADIC",92,26010716,"MASCOT Score",49.2000000,,,,,0.037599999457598,
SYADELVKTAKTIASPGR,nt,S,50,true,"Stromal N-terminome",96,26371235,"MASCOT Score",38.8300000,,,,,,
SYADELVKTAKTIASPGR,nt,S,50,true,"HUNTER N-terminome: legumain, GluC and trypsin",119,31951383,"MaxQuant score",73.0570000,,,,,,
TAKTIASPGR,ac,K,60,true,"Quantitative Acetylproteomics",101,29440448,,,,,,,,
TIASPGRGILAMDESNATCGK,ph,T,61,true,"srk2dei ABA signaling phopshoproteomics",83,23572148,"MASCOT Score",43.0000000,,,,,,0.0007000
TAKTIASPGR,ph,T,61,true,"atm and atr DNA damage response",88,25561503,"MASCOT Score",25.0000000,0.9950000,,,,,-2.4700000
TAKTIASPGR,ph,T,61,true,"Tissue atlas Arabidopsis - ProteomicsDB",114,32188942,"MaxQuant score",79.4660000,0.9996720,,,,0.0067182900384068,
TIASPGRGILAMDESNATCGK,ph,S,64,true,"srk2dei ABA signaling phopshoproteomics",83,23572148,"MASCOT Score",77.0000000,,,,,,0.0009000
TIASPGRGILAMDESNATCGK,ph,S,64,true,"TOR Kinase and ABA Receptor",100,29290610,XCorr,3.6379492,0.9972000,,,,6.6469998273533E-5,
TIASPGRGILAMDESNATCGK,me1,R,67,true,"Arabidopsis protein methylome",123,31809900,"MaxQuant Score",45.3470000,1.0000000,,,,0.00077126297401264,0.2669000
GILAMDESNATCGK,ph,S,75,true,"srk2dei ABA signaling phopshoproteomics",83,23572148,"MASCOT Score",64.0000000,,,,,,0.0000000
GILAMDESNATCGK,ph,S,75,true,"atm and atr DNA damage response",88,25561503,"MASCOT Score",41.0000000,1.0000000,,,,,0.2400000
GILAMDESNATCGK,ph,S,75,true,"Tissue atlas Arabidopsis - ProteomicsDB",114,32188942,"MaxQuant score",181.7200000,0.9986020,,,,3.136729946946E-23,
GILAMDESNATCGK,ph,T,78,true,"Large-scale phosphorylation discovery",44,23111157,XCorr,3.7060000,,,,,,
GILAMDESNATCGK,ph,T,78,true,"Tissue atlas Arabidopsis - ProteomicsDB",114,32188942,"MaxQuant score",169.3700000,0.9999840,,,,1.0185599778095E-15,
GILAMDESNATCGK,sno,C,79,true,"Cold stress nitrosylation - 4°C vs 22°C",65,24388526,,,,1.4329594,,NO,,
GILAMDESNATCGK,sno,C,79,true,"Site-specific nitrosomeproteomic id - gsnor1-3",90a,25699590,XCorr,4.1376057,,,,,0.13320000469685,-5.7716571
GILAMDESNATCGK,sno,C,79,true,"Site-specific nitrosomeproteomic id - gsnor1-3",90b,25699590,XCorr,3.7297022,,,,,0.01642999984324,-7.3460675
GILAMDESNATCGK,sno,C,79,true,"hot5-4 / wildtype, FAT-switch S-nitrosoproteome",169,37277371,,,,-0.8679063,0.0048534,YES,,
GILAMDESNATCGKR,ac,K,81,true,"Histone deacetylases - apicidin vs control",98a,29061669,"MaxQuant Score",167.6000000,1.0000000,-0.0890000,0.6280584,NO,0,
GILAMDESNATCGKR,ac,K,81,true,"Histone deacetylases- hda14 vs WT (low light)",98c,29061669,"MaxQuant Score",309.2300000,1.0000000,-0.1510000,0.9885531,NO,1.1999318750013E-41,
GILAMDESNATCGKR,ac,K,81,true,"Histone deacetylases substrates - hda14 vs WT",98e,29061669,"MaxQuant Score",69.9000000,1.0000000,0.0630000,0.9120108,NO,1.3000000080865E-6,
LDSIGLENTEANR,nt,L,83,true,"Stromal N-terminome",96,26371235,"MASCOT Score",84.7900000,,,,,,
RLDSIGLENTEANR,ph,S,85,true,"atm and atr DNA damage response",88,25561503,"MASCOT Score",46.0000000,1.0000000,,,,,0.1600000
LDSIGLENTEANR,ph,S,85,true,"Tissue atlas Arabidopsis - ProteomicsDB",114,32188942,"MaxQuant score",122.6400000,1.0000000,,,,6.532970292028E-5,
KMVDVLVEQNIVPGIK,ac,K,131,false,"Histone deacetylases - apicidin vs control",98a,29061669,"MaxQuant Score",48.9000000,1.0000000,-0.0970000,0.7585776,NO,9.9999997473788E-5,
QNIVPGIKVDKGLVPLVGSNNE,nt,Q,139,true,"HUNTER N-terminome: legumain, GluC and trypsin",119,31951383,"MaxQuant score",135.5400000,,,,,,
SWCQGLDGLSSR,nt,S,161,true,"N-terminal ChaFRADIC",92,26010716,"MASCOT Score",37.1800000,,,,,4.7149998749774E-7,
SWCQGLDGLS,nt,S,161,true,"N-terminal ChaFRADIC",92,26010716,"MASCOT Score",71.9800000,,,,,0.00504200020805,
TVVSIPNGPSALAVKE,nt,T,188,false,"HUNTER N-terminome: legumain, GluC and trypsin",119,31951383,"MaxQuant score",64.6500000,,,,,,
WRTVVSIPNGPSALAVK,ph,T,188,false,"Tissue atlas Arabidopsis - ProteomicsDB",114,32188942,"MaxQuant score",57.2200000,0.9406310,,,,0.00069662998430431,
TVVSIPNGPSALAVK,ph,S,191,false,"TOR Kinase and ABA Receptor",100,29290610,XCorr,2.5309067,0.9742000,,,,0.0040859999135137,
TVVSIPNGPSALAVK,ph,S,191,false,"Tissue atlas Arabidopsis - ProteomicsDB",114,32188942,"MaxQuant score",138.8100000,0.9999800,,,,6.4646400232959E-7,
GPSALAVKE,nt,G,195,false,"Arg/N-end rule seed, prt6 vs. Wt",99,29168982,"MASCOT Score",29.5400000,,,,,0.00021129999367986,-1.4827971
TVVSIPNGPSALAVKEAAWGLAR,ac,K,202,false,"Histone deacetylases- hda14 vs WT (low light)",98c,29061669,"MaxQuant Score",163.1800000,1.0000000,-1.4380000,0.9183326,NO,1.9999999649033E-14,
TVVSIPNGPSALAVK,ac,K,202,false,"Quantitative Acetylproteomics",101,29440448,,,,,,,,
GLVPIVEPE,nt,G,219,false,"Arg/N-end rule seed, prt6 vs. Wt",99,29168982,"MASCOT Score",57.5400000,,,,,0.0035119999665767,-1.1699265
AQNNVMFE,nt,A,255,false,"Arg/N-end rule seed, prt6 vs. Wt",99,29168982,"MASCOT Score",44.3200000,,,,,0.028699999675155,-0.8877455
QNNVMFE,nt,Q,256,false,"Arg/N-end rule seed, prt6 vs. Wt",99,29168982,"MASCOT Score",49.5500000,,,,,0.048530001193285,-0.4171358
MVTPGAESKDR,nt,M,270,true,"FtsH12 N-terminome: WT / FtsH12 knockdown miRNA",118,33216923,"MaxQuant score",62.8610000,,,,,0.0010461000492796,
DRATPEQVAAYTLK,ph,T,282,true,"atm and atr DNA damage response",88,25561503,"MASCOT Score",55.0000000,1.0000000,,,,,-0.6000000
DRATPEQVAAYTLK,ph,T,282,true,"Tissue atlas Arabidopsis - ProteomicsDB",114,32188942,"MaxQuant score",170.8900000,1.0000000,,,,5.0194901403747E-15,
ATPEQVAAYTLKLLR,ac,K,292,true,"Histone deacetylases substrates - TSA vs control",98b,29061669,"MaxQuant Score",127.2000000,1.0000000,-0.2110000,0.9794900,NO,1.5000000583808E-17,
ATPEQVAAYTLKLLR,me1,K,292,true,"Arabidopsis protein methylome",123,31809900,"MaxQuant Score",86.4970000,1.0000000,,,,2.9262898817167E-25,-0.1483000
NRVPPAVPGIMFLSGGQSEVEATLNLNAMNQAPNPWHVSFSYAR,nt,N,296,true,"Stromal N-terminome",96,26371235,"MASCOT Score",52.9000000,,,,,,
VPPAVPGIMFLSGGQSEVEATLNLNAMNQAPNPWHVSFSYAR,nt,V,298,true,"Stromal N-terminome",96,26371235,"MASCOT Score",85.9600000,,,,,,
FLSGGQSE,nt,F,307,false,"Arg/N-end rule seed, prt6 vs. Wt",99,29168982,"MASCOT Score",49.5100000,,,,,0.0094910003244877,0.4503057
SGGQSEVEAT,nt,S,309,true,"N-terminal ChaFRADIC",92,26010716,"MASCOT Score",26.7900000,,,,,0.00011770000128308,
QAPNPWHVSFSYARALQN,nt,Q,326,false,"HUNTER N-terminome: legumain, GluC and trypsin",119,31951383,"MaxQuant score",132.6400000,,,,,,
ALQNTCLK,ox,C,345,false,"OxiTRAQ Arabidopsis - 5 mM H2O2 versus control",47,24376095,,,,0.1995188,0.2102756,NO,,
ALQNTCLKTWGGRPENVNAAQTTLLAR,sno,C,345,true,"Site-specific nitrosomeproteomic id - gsnor1-3",90b,25699590,XCorr,2.7600000,,,,,0.0014550000196323,-7.2000000
ALQNTCLK,sno,C,345,false,"Cold stress nitrosylation - 4°C vs 22°C",65,24388526,,,,1.2630344,,NO,,
ALQNTCLK,sno,C,345,false,"hot5-4 / wildtype, FAT-switch S-nitrosoproteome",169,37277371,,,,,,,,
ALQNTCLK,so,C,345,false,"Arabidopsis S-sulfenylation chemoproteomics",108,31578252,"pFind PSM Score",0.0744135,,0.9957700,,,,0.7313112
ALQNTCLK,so,C,345,false,"S-sulfenylation site detection using YAP1C",110,32714340,,,,,,,,
ALQNTCLKTWGGRPENVNAAQTTLLAR,ac,K,347,true,"Histone deacetylases- hda14 vs WT (low light)",98c,29061669,"MaxQuant Score",283.6400000,1.0000000,-0.1410000,0.9885531,NO,0,
ALQNTCLKTWGGRPENVNAAQTTLLAR,hib,K,347,true,"Open search Plant PTM Viewer 2.0 - hib",164e,TBA,,,,,,,,
AKANSLAQLGK,ac,K,368,false,"Quantitative Acetylproteomics",101,29440448,,,,,,,,
ANSLAQLGK,ph,S,371,false,"atm and atr DNA damage response",88,25561503,"MASCOT Score",42.0000000,1.0000000,,,,,-1.1100000
ANSLAQLGKYTGEGESEEAK,ac,K,377,false,"Histone deacetylases - apicidin vs control",98a,29061669,"MaxQuant Score",128.0000000,1.0000000,-0.0430000,0.8609938,NO,0,
ANSLAQLGKYTGEGESEEAK,ac,K,377,false,"Histone deacetylases substrates - TSA vs control",98b,29061669,"MaxQuant Score",128.0000000,1.0000000,0.1180000,0.9977001,NO,0,
ANSLAQLGKYTGEGESEEAK,ac,K,377,false,"Histone deacetylases- hda14 vs WT (low light)",98c,29061669,"MaxQuant Score",116.9400000,1.0000000,-1.9810000,0.2992265,NO,3.0999999580672E-6,
ANSLAQLGKYTGEGESEEAK,ac,K,377,false,"Histone deacetylases substrates - hda14 vs WT",98e,29061669,"MaxQuant Score",137.0000000,1.0000000,0.0720000,0.9162205,NO,8.0995051237974E-43,
ANSLAQLGKYTGEGESEEAK,ac,K,377,false,"Quantitative Acetylproteomics",101,29440448,,,,,,,,
YTGEGESEEAK,ph,S,384,false,"atm and atr DNA damage response",88,25561503,"MASCOT Score",58.0000000,1.0000000,,,,,-0.3600000
YTGEGESEEAK,ph,S,384,false,"Tissue atlas Arabidopsis - ProteomicsDB",114,32188942,"MaxQuant score",100.0200000,1.0000000,,,,8.4893697930966E-5,
YTGEGESEEAK,ac,K,388,false,"Quantitative Acetylproteomics",101,29440448,,,,,,,,
YTGEGESEEAKEGMFVKGYTY,me3,K,388,false,"Arabidopsis protein methylome",123,31809900,"MaxQuant Score",204.4700000,1.0000000,,,,0,0.2853200
YTGEGESEEAKEGMFVKGYTY,ac,K,394,false,"Lysine acetylation gel-based Finkemeier et al",37,21311031,i-probability,1.0000000,,,,,,
EGMFVKGYTY,me2,K,394,false,"Arabidopsis protein methylome",123,31809900,"MaxQuant Score",141.7800000,1.0000000,,,,0,2.1659000
GMFVKGYTY,me2,K,394,false,"Arabidopsis protein methylome",123,31809900,"MaxQuant Score",83.6470000,1.0000000,,,,0.008319029584527,-0.2277200
YTGEGESEEAKEGMFVKGYTY,me3,K,394,false,"Arabidopsis protein methylome",123,31809900,"MaxQuant Score",204.4700000,1.0000000,,,,0,0.2853200
GMFVKGYTY,me3,K,394,false,"Arabidopsis protein methylome",123,31809900,"MaxQuant Score",81.9720000,1.0000000,,,,0.010066700167954,-0.2341400
