Peptide,PTM,ModifiedAA,ModifiedPosition,PeptideUniqueToGene,ExperimentDesc,ExpID,PubmedID,ScoreType,IdentScore,LocProb,Log2FChange,PQ-val,QuantSig,PEP,MassErrorPPM
GDTEKCNSDMIQR,nt,G,2,true,"Arg/N-end rule seed, prt6 vs. Wt",99,29168982,"MASCOT Score",44.8900000,,,,,0.012470000423491,-1.4214764
GDTEKCNSDMIQR,nta,G,2,true,"Arg/N-end rule seed, prt6 vs. Wt",99,29168982,"MASCOT Score",44.8900000,,0.1909049,0.8037001,NO,0.012470000423491,-1.4214764
GDTEKCNSDMIQR,nta,G,2,true,"Arabidopsis translation initiation landscape - NTA",167a,35069635,,,,,,,,
LHSSFGTTSSSIPK,ph,S,17,true,"Tissue atlas Arabidopsis - ProteomicsDB",114,32188942,"MaxQuant score",215.5600000,0.9951930,,,,0,
LHSSFGTTSSSIPK,ph,S,18,true,"Tissue atlas Arabidopsis - ProteomicsDB",114,32188942,"MaxQuant score",157.8200000,0.9869520,,,,1.9131099482372E-10,
SSAPQFSKPFSDSGKR,ph,S,55,true,"Tissue atlas Arabidopsis - ProteomicsDB",114,32188942,"MaxQuant score",122.3500000,0.9338270,,,,4.2791299392775E-8,
SSAPQFSKPFSDSGKR,ac,K,57,true,"Quantitative Acetylproteomics",101,29440448,,,,,,,,
RIGVPPSHPNLIPPTSPFSQIPTTR,ph,T,72,true,"TOR Kinase and ABA Receptor",100,29290610,XCorr,3.4742615,0.8594000,,,,0.025760000571609,
IGVPPSHPNLIPPTSPFSQIPTTR,ph,S,73,true,"Tissue atlas Arabidopsis - ProteomicsDB",114,32188942,"MaxQuant score",101.3400000,0.7842760,,,,1.5223499491364E-16,
SMSQPNSFFSFDSLPPLSPSPFR,ph,S,99,true,"TOR Kinase and ABA Receptor",100,29290610,XCorr,4.3552494,0.8707000,,,,0.00021699999342673,
DSGVFNSNHSLPPSPFTR,fuc,S,144,true,"SPINDLY O-fucosylation",162,36739885,,,,,,,1.2000000476837,
DSGVFNSNHSLPPSPFTR,fuc,T,147,true,"SPINDLY O-fucosylation",162,36739885,,,,,,,-0.91000002622604,
CNSTSSSSLR,ph,S,151,true,"atm and atr DNA damage response",88,25561503,"MASCOT Score",54.0000000,0.9320000,,,,,0.0000000
CNSTSSSSLR,ph,S,151,true,"Tissue atlas Arabidopsis - ProteomicsDB",114,32188942,"MaxQuant score",105.0300000,0.9837870,,,,0.00029185198945925,
CNSTSSSSLR,ph,T,152,true,"atm and atr DNA damage response",88,25561503,"MASCOT Score",21.0000000,0.9820000,,,,,-3.5400000
CNSTSSSSLR,ph,S,153,true,"atm and atr DNA damage response",88,25561503,"MASCOT Score",23.0000000,0.9810000,,,,,-4.0100000
RSNSDIPSGFNSMPLIPPRPLER,ph,S,172,true,"TOR Kinase and ABA Receptor",100,29290610,XCorr,2.8924689,0.7733000,,,,0.019419999793172,
SNSDIPSGFNSMPLIPPRPLER,ph,S,174,true,"TOR Kinase and ABA Receptor",100,29290610,XCorr,3.0423231,0.9502000,,,,0.0036500000860542,
SNSDIPSGFNSMPLIPPRPLER,ph,S,174,true,"Phospho cell culture sucrose/TOR",109,30833711,,,0.9332400,,,,,
SNSDIPSGFNSMPLIPPRPLER,ph,S,174,true,"Tissue atlas Arabidopsis - ProteomicsDB",114,32188942,"MaxQuant score",149.2000000,0.9987620,,,,1.5992999208991E-33,
SFSGGECADWSK,ph,S,194,true,"Tissue atlas Arabidopsis - ProteomicsDB",114,32188942,"MaxQuant score",129.5400000,0.9930400,,,,3.8450198189821E-5,
SFSGGECADWSK,ph,S,196,true,"Arabidopsis root NAA phosphoproteome",18a,27643528,"MaxQuant Score",84.5080000,1.0000000,,,,5.3790000720255E-7,0.0590000
SFSGGECADWSK,ph,S,196,true,"Phosphoproteomic analysis of seed maturation",42,22440515,"MASCOT Score",82.0000000,,,,,,-1.4800000
SFSGGECADWSK,ph,S,196,true,"Tyrosine phosphorylation in Arabidopsis",59,18463617,"MASCOT Score",78.0000000,,,,,,-0.3547369
SFSGGECADWSK,ph,S,196,true,"srk2dei ABA signaling phopshoproteomics",83,23572148,"MASCOT Score",84.0000000,,,,,,0.0000000
SFSGGECADWSK,ph,S,196,true,"LAXIC - ABA stress",84a,23660473,XCorr,3.3800000,0.9990000,,,,0.00022654699569102,
SFSGGECADWSK,ph,S,196,true,"LAXIC - mannitol vs control",84b,23660473,XCorr,3.1700000,0.9990000,,,,7.5700001616497E-5,
SFSGGECADWSK,ph,S,196,true,"SnRK2 protein kinase substrates",85,23776212,XCorr,2.8709309,0.9990000,,,,1.390039983562E-6,
SFSGGECADWSK,ph,S,196,true,"atm and atr DNA damage response",88,25561503,"MASCOT Score",68.0000000,1.0000000,,,,,-0.3500000
SFSGGECADWSK,ph,S,196,true,"TOR Kinase and ABA Receptor",100,29290610,XCorr,3.1687930,0.9997000,,,,6.8369998189155E-5,
SFSGGECADWSK,ph,S,196,true,"Lateral root-induction - NAA vs control",106,23328941,"MASCOT Score",31.0000000,,,,,,
SFSGGECADWSK,ph,S,196,true,"Phospho cell culture sucrose/TOR",109,30833711,,,1.0000000,,,,,
SFSGGECADWSK,ph,S,196,true,"Col-0 callus - FC Col-0 vs. Col-0 Xray",111a,31410901,,85.8200000,,0.8365326,0.0000000,NO,,0.6311383
SFSGGECADWSK,ph,S,196,true,"Col-0 X-ray callus - FC Col-0 vs. Col-0 Xray",111b,31410901,,85.8200000,,0.8365326,0.0000000,NO,,0.6311383
SFSGGECADWSK,ph,S,196,true,"atm callus - FC atm vs. atm Xray",111c,31410901,,85.8200000,,-6.0215569,0.0000000,NO,,0.6311383
SFSGGECADWSK,ph,S,196,true,"atm-3 X-ray callus - FC atm vs. atm Xray",111d,31410901,,85.8200000,,-6.0215569,0.0000000,NO,,0.6311383
SFSGGECADWSK,ph,S,196,true,"Tissue atlas Arabidopsis - ProteomicsDB",114,32188942,"MaxQuant score",269.9300000,1.0000000,,,,0,
SVSVDSCFMEK,ph,S,321,true,"Arabidopsis root NAA phosphoproteome",18a,27643528,"MaxQuant Score",60.6570000,0.9970000,,,,0.00011559999984456,-0.4830000
SVSVDSCFMEK,ph,S,321,true,"Phosphoproteomic analysis of seed maturation",42,22440515,"MASCOT Score",60.0000000,,,,,,-2.9600000
SVSVDSCFMEK,ph,S,321,true,"Tyrosine phosphorylation in Arabidopsis",59,18463617,"MASCOT Score",47.0000000,,,,,,-0.3656272
SVSVDSCFMEK,ph,S,321,true,"srk2dei ABA signaling phopshoproteomics",83,23572148,"MASCOT Score",68.0000000,,,,,,0.0002000
SVSVDSCFMEK,ph,S,321,true,"LAXIC - mannitol vs control",84b,23660473,XCorr,2.4400000,0.9360000,,,,0.0020841299556196,
SVSVDSCFMEK,ph,S,321,true,"SnRK2 protein kinase substrates",85,23776212,XCorr,2.5433795,0.9450000,,,,0.011026199907064,
SVSVDSCFMEK,ph,S,321,true,"atm and atr DNA damage response",88,25561503,"MASCOT Score",60.0000000,1.0000000,,,,,-0.4400000
SVSVDSCFMEK,ph,S,321,true,"TOR Kinase and ABA Receptor",100,29290610,XCorr,2.6454234,0.9957000,,,,0.00082429999019951,
SVSVDSCFMEK,ph,S,321,true,"Lateral root-induction - NAA vs control",106,23328941,"MASCOT Score",27.0000000,,,,,,
SVSVDSCFMEK,ph,S,321,true,"Phospho cell culture sucrose/TOR",109,30833711,,,0.9999660,,,,,
SVSVDSCFMEK,ph,S,321,true,"Col-0 callus - FC Col-0 vs. Col-0 Xray",111a,31410901,,67.7200000,,0.6364798,0.0000000,NO,,0.7095138
SVSVDSCFMEK,ph,S,321,true,"Col-0 X-ray callus - FC Col-0 vs. Col-0 Xray",111b,31410901,,67.7200000,,0.6364798,0.0000000,NO,,0.7095138
SVSVDSCFMEK,ph,S,321,true,"atm callus - FC atm vs. atm Xray",111c,31410901,,67.7200000,,0.6497759,0.0000000,NO,,0.7095138
SVSVDSCFMEK,ph,S,321,true,"atm-3 X-ray callus - FC atm vs. atm Xray",111d,31410901,,67.7200000,,0.6497759,0.0000000,NO,,0.7095138
SVSVDSCFMEK,ph,S,321,true,"Tissue atlas Arabidopsis - ProteomicsDB",114,32188942,"MaxQuant score",191.9300000,1.0000000,,,,2.7435099376546E-18,
SVSVDSCFMEK,ph,S,324,true,"atm and atr DNA damage response",88,25561503,"MASCOT Score",60.0000000,1.0000000,,,,,-0.4400000
LSFGDESLKPPPSPGSMSR,ph,S,342,true,"Lateral root-induction - NAA vs control",106,23328941,"MASCOT Score",41.0000000,,,,,,
LSFGDESLKPPPSPGSMSR,ph,S,342,true,"Phospho cell culture sucrose/TOR",109,30833711,,,0.9566900,,,,,
LSFGDESLKPPPSPGSMSR,ph,S,342,true,"Col-0 callus - FC Col-0 vs. Col-0 Xray",111a,31410901,,31.6800000,,0.4467569,0.0000000,NO,,0.7568382
LSFGDESLKPPPSPGSMSR,ph,S,342,true,"Col-0 X-ray callus - FC Col-0 vs. Col-0 Xray",111b,31410901,,31.6800000,,0.4467569,0.0000000,NO,,0.7568382
LSFGDESLKPPPSPGSMSR,ph,S,342,true,"atm callus - FC atm vs. atm Xray",111c,31410901,,31.6800000,,0.3457298,0.0000000,NO,,0.7568382
LSFGDESLKPPPSPGSMSR,ph,S,342,true,"atm-3 X-ray callus - FC atm vs. atm Xray",111d,31410901,,31.6800000,,0.3457298,0.0000000,NO,,0.7568382
LSFGDESLKPPPSPGSMSR,ph,S,342,true,"Tissue atlas Arabidopsis - ProteomicsDB",114,32188942,"MaxQuant score",179.7900000,0.9987310,,,,8.3657518320192E-42,
LSFGDESLKPPPSPGSMSR,ph,S,345,true,"srk2dei ABA signaling phopshoproteomics",83,23572148,"MASCOT Score",34.0000000,,,,,,0.0005000
LSFGDESLKPPPSPGSMSR,ph,S,345,true,"Lateral root-induction - NAA vs control",106,23328941,"MASCOT Score",41.0000000,,,,,,
LSFGDESLKPPPSPGSMSR,ph,S,345,true,"Tissue atlas Arabidopsis - ProteomicsDB",114,32188942,"MaxQuant score",186.4400000,0.8408600,,,,4.3621501942639E-37,
LSFGDESLKPPPSPGSMSR,ph,S,347,true,"srk2dei ABA signaling phopshoproteomics",83,23572148,"MASCOT Score",34.0000000,,,,,,0.0005000
LSFGDESLKPPPSPGSMSR,ph,S,347,true,"Col-0 callus - FC Col-0 vs. Col-0 Xray",111a,31410901,,28.4500000,,0.4610840,0.0000000,NO,,0.6531120
LSFGDESLKPPPSPGSMSR,ph,S,347,true,"Col-0 X-ray callus - FC Col-0 vs. Col-0 Xray",111b,31410901,,28.4500000,,0.4610840,0.0000000,NO,,0.6531120
LSFGDESLKPPPSPGSMSR,ph,S,347,true,"atm callus - FC atm vs. atm Xray",111c,31410901,,28.4500000,,0.7298609,0.0000000,NO,,0.6531120
LSFGDESLKPPPSPGSMSR,ph,S,347,true,"atm-3 X-ray callus - FC atm vs. atm Xray",111d,31410901,,28.4500000,,0.7298609,0.0000000,NO,,0.6531120
LSFGDESLKPPPSPGSMSR,ph,S,347,true,"Tissue atlas Arabidopsis - ProteomicsDB",114,32188942,"MaxQuant score",185.4500000,0.9297740,,,,5.7478500767071E-37,
