Peptide,PTM,ModifiedAA,ModifiedPosition,PeptideUniqueToGene,ExperimentDesc,ExpID,PubmedID,ScoreType,IdentScore,LocProb,Log2FChange,PQ-val,QuantSig,PEP,MassErrorPPM
SDVIAEHAVDTSVEGDAKAALPVQSTKQF,nta,S,2,true,"Arabidopsis translation initiation landscape - NTA",167a,35069635,,,,,,,,
SDVIAEHAVDTSVEGDAK,nta,S,2,true,"Characterization plant N-terminal acetylation",6,22223895,"MASCOT Score",82.9400000,,,,,,
SDVIAEHAVDTSVEGDAK,ph,S,2,true,"atm and atr DNA damage response",88,25561503,"MASCOT Score",42.0000000,0.9990000,,,,,-0.4800000
SDVIAEHAVDTSVEGDAK,ph,S,2,true,"Tissue atlas Arabidopsis - ProteomicsDB",114,32188942,"MaxQuant score",206.6300000,1.0000000,,,,0,
SDVIAEHAVDTSVEGDAK,ph,S,13,true,"Tissue atlas Arabidopsis - ProteomicsDB",114,32188942,"MaxQuant score",126.0400000,0.8822120,,,,2.0878799719942E-14,
EFLCPPPPSR,ox,C,54,true,"OxiTRAQ Arabidopsis - 5 mM H2O2 versus control",47,24376095,,,,0.4291836,0.4130508,YES,,
SVKQNDAADVR,ub,K,63,true,"Arabidopsis ubiquitination COFRADIC",40,26744219,"MaxQuant Score",80.6900000,1.0000000,,,,8.8200002210215E-5,2.7150000
EQSTINLCPQVAR,ox,C,100,true,"OxiTRAQ Arabidopsis - 5 mM H2O2 versus control",47,24376095,,,,0.0424833,0.6776916,NO,,
EQSTINLCPQVAR,so,C,100,true,"S-sulfenylation site detection using YAP1C",110,32714340,,,,,,,,
NIVEVSSSIVETPITIK,ph,T,466,true,"SnRK2 protein kinase substrates",85,23776212,XCorr,2.4873261,0.8790000,,,,0.03483010083437,
