Peptide,PTM,ModifiedAA,ModifiedPosition,PeptideUniqueToGene,ExperimentDesc,ExpID,PubmedID,ScoreType,IdentScore,LocProb,Log2FChange,PQ-val,QuantSig,PEP,MassErrorPPM
TVSKSTPGSPAHPPGAR,ph,S,28,true,"atm and atr DNA damage response",88,25561503,"MASCOT Score",38.0000000,0.9940000,,,,,0.6700000
TVSKSTPGSPAHPPGAR,ph,S,28,true,"Tissue atlas Arabidopsis - ProteomicsDB",114,32188942,"MaxQuant score",151.5700000,0.9893470,,,,2.4686098976621E-13,
STPGSPAHPPGAR,ph,S,28,true,"atm and atr DNA damage response",88,25561503,"MASCOT Score",41.0000000,1.0000000,,,,,0.0200000
STPGSPAHPPGARSPPPSYLSNK,ph,S,32,true,"TOR Kinase and ABA Receptor",100,29290610,XCorr,2.8400981,0.8965000,,,,0.0047470000572503,
TVSKSTPGSPAHPPGAR,ph,S,32,true,"atm and atr DNA damage response",88,25561503,"MASCOT Score",38.0000000,1.0000000,,,,,0.6700000
STPGSPAHPPGAR,ph,S,32,true,"atm and atr DNA damage response",88,25561503,"MASCOT Score",41.0000000,1.0000000,,,,,-0.0700000
STPGSPAHPPGAR,ph,S,32,true,"Phospho cell culture sucrose/TOR",109,30833711,,,0.9884340,,,,,
STPGSPAHPPGAR,ph,S,32,true,"Tissue atlas Arabidopsis - ProteomicsDB",114,32188942,"MaxQuant score",121.7500000,0.9999910,,,,5.5105298102376E-9,
STPGSPAHPPGARSPPPSYLSNK,ph,S,41,true,"PAMP-triggered phosphorylation",48,24601666,"MASCOT Score",46.6100000,,,,,,
STPGSPAHPPGARSPPPSYLSNK,ph,S,41,true,"srk2dei ABA signaling phopshoproteomics",83,23572148,"MASCOT Score",40.0000000,,,,,,-0.0008000
STPGSPAHPPGARSPPPSYLSNK,ph,S,41,true,"atm and atr DNA damage response",88,25561503,"MASCOT Score",26.0000000,1.0000000,,,,,-0.4600000
STPGSPAHPPGARSPPPSYLSNK,ph,S,41,true,"TOR Kinase and ABA Receptor",100,29290610,XCorr,2.8400981,0.9347000,,,,0.0047470000572503,
SPPPSYLSNKR,ph,S,41,true,"Chloroplast kinase substrates",60,19376835,"MASCOT Score",40.6100000,,,,,,-0.7676450
SPPPSYLSNK,ph,S,41,true,"STN8 phosphoproteome",38,21768351,"MASCOT Score",46.1500000,,,,,,-0.4864310
SPPPSYLSNK,ph,S,41,true,"Chloroplast kinase substrates",60,19376835,"MASCOT Score",50.9900000,,,,,,-0.3668270
SPPPSYLSNK,ph,S,41,true,"srk2dei ABA signaling phopshoproteomics",83,23572148,"MASCOT Score",46.0000000,,,,,,-0.0001000
SPPPSYLSNK,ph,S,41,true,"LAXIC - mannitol vs control",84b,23660473,XCorr,2.4200000,0.9990000,,,,0.034896399825811,
SPPPSYLSNK,ph,S,41,true,"SnRK2 protein kinase substrates",85,23776212,XCorr,2.6483250,1.0000000,,,,0.0062766801565886,
SPPPSYLSNK,ph,S,41,true,"atm and atr DNA damage response",88,25561503,"MASCOT Score",53.0000000,1.0000000,,,,,0.0600000
SPPPSYLSNK,ph,S,41,true,"Lateral root-induction - NAA vs control",106,23328941,"MASCOT Score",30.0000000,,,,,,
SPPPSYLSNK,ph,S,41,true,"Tissue atlas Arabidopsis - ProteomicsDB",114,32188942,"MaxQuant score",201.0900000,1.0000000,,,,0,
STPGSPAHPPGARSPPPSYLSNK,ph,S,45,true,"TOR Kinase and ABA Receptor",100,29290610,XCorr,3.1445601,0.8073000,,,,0.026300000026822,
SPPPSYLSNK,ph,S,45,true,"atm and atr DNA damage response",88,25561503,"MASCOT Score",25.0000000,0.8920000,,,,,-0.7000000
RAETEYDFPMSNEQRPYWK,ph,T,54,true,"TOR Kinase and ABA Receptor",100,29290610,XCorr,4.5018587,0.9907000,,,,3.2989999454003E-5,
AETEYDFPMSNEQRPYWK,ph,T,54,true,"Tissue atlas Arabidopsis - ProteomicsDB",114,32188942,"MaxQuant score",126.5900000,1.0000000,,,,9.2142200648431E-15,
RAETEYDFPMSNEQR,ph,T,54,true,"atm and atr DNA damage response",88,25561503,"MASCOT Score",51.0000000,0.9980000,,,,,0.1500000
QPASERVPNSHPRPPVYGYGTPDHR,ph,S,73,true,"Tissue atlas Arabidopsis - ProteomicsDB",114,32188942,"MaxQuant score",49.4640000,0.8148960,,,,0.00089675199706107,
VPNSHPRPPVYGYGTPDHR,ph,T,90,true,"TOR Kinase and ABA Receptor",100,29290610,XCorr,4.0155816,0.8888000,,,,1.7770000582118E-8,
VPNSHPRPPVYGYGTPDHR,ph,T,90,true,"Tissue atlas Arabidopsis - ProteomicsDB",114,32188942,"MaxQuant score",176.1400000,1.0000000,,,,3.7614699779533E-29,
MEAMSYEPETNAPSSPYHPAGNRTPERPR,ph,S,106,true,"Tissue atlas Arabidopsis - ProteomicsDB",114,32188942,"MaxQuant score",128.6500000,0.8519410,,,,9.6829723884845E-43,
MEAMSYEPETNAPSSPYHPAGNRTPERPR,ph,Y,107,true,"Tissue atlas Arabidopsis - ProteomicsDB",114,32188942,"MaxQuant score",97.2890000,0.8531620,,,,3.3672701288758E-23,
MEAMSYEPETNAPSSPYHPAGNRTPERPR,ph,T,111,true,"Tissue atlas Arabidopsis - ProteomicsDB",114,32188942,"MaxQuant score",163.4800000,0.9872780,,,,0,
MEAMSYEPETNAPSSPYHPAGNRTPERPRK,ph,S,115,true,"TOR Kinase and ABA Receptor",100,29290610,XCorr,4.0319819,0.7559000,,,,0.00079720001667738,
MEAMSYEPETNAPSSPYHPAGNRTPERPR,ph,S,115,true,"PAMP-triggered phosphorylation",48,24601666,"MASCOT Score",60.3600000,,,,,,
MEAMSYEPETNAPSSPYHPAGNRTPERPR,ph,S,115,true,"TOR Kinase and ABA Receptor",100,29290610,XCorr,4.2814660,0.7866000,,,,1.6160000086529E-5,
MEAMSYEPETNAPSSPYHPAGNRTPERPR,ph,S,115,true,"Tissue atlas Arabidopsis - ProteomicsDB",114,32188942,"MaxQuant score",242.9000000,0.9050390,,,,0,
MEAMSYEPETNAPSSPYHPAGNR,ph,S,115,true,"MAPK Arabidopsis substrates",45,23172892,"MaxQuant Score",67.9950000,,,,,,
MEAMSYEPETNAPSSPYHPAGNR,ph,S,115,true,"Lateral root-induction - NAA vs control",106,23328941,"MASCOT Score",40.0000000,,,,,,
ERMEAMSYEPETNAPSSPYHPAGNRTPERPR,ph,S,116,true,"TOR Kinase and ABA Receptor",100,29290610,XCorr,4.5848789,0.9540000,,,,0.0065419999882579,
MEAMSYEPETNAPSSPYHPAGNRTPERPR,ph,S,116,true,"PAMP-triggered phosphorylation",48,24601666,"MASCOT Score",26.8400000,,,,,,
MEAMSYEPETNAPSSPYHPAGNR,ph,S,116,true,"Large-scale phosphorylation discovery",44,23111157,XCorr,5.8530000,,,,,,
MEAMSYEPETNAPSSPYHPAGNR,ph,S,116,true,"srk2dei ABA signaling phopshoproteomics",83,23572148,"MASCOT Score",25.0000000,,,,,,0.0028000
MEAMSYEPETNAPSSPYHPAGNR,ph,S,116,true,"atm and atr DNA damage response",88,25561503,"MASCOT Score",45.0000000,1.0000000,,,,,0.2500000
MEAMSYEPETNAPSSPYHPAGNR,ph,S,116,true,"TOR Kinase and ABA Receptor",100,29290610,XCorr,4.4501238,0.8885000,,,,7.4169997787976E-7,
MEAMSYEPETNAPSSPYHPAGNR,ph,S,116,true,"Tissue atlas Arabidopsis - ProteomicsDB",114,32188942,"MaxQuant score",317.7200000,0.9703940,,,,0,
MEAMSYEPETNAPSSPYHPAGNRTPERPR,ph,Y,118,true,"Large-scale phosphorylation discovery",44,23111157,XCorr,5.1540000,,,,,,
MEAMSYEPETNAPSSPYHPAGNRTPERPR,ph,Y,118,true,"atm and atr DNA damage response",88,25561503,"MASCOT Score",28.0000000,0.7990000,,,,,-0.5500000
MEAMSYEPETNAPSSPYHPAGNRTPERPR,ph,Y,118,true,"Tissue atlas Arabidopsis - ProteomicsDB",114,32188942,"MaxQuant score",265.2500000,0.8361150,,,,0,
ERMEAMSYEPETNAPSSPYHPAGNRTPERPR,ph,T,125,true,"TOR Kinase and ABA Receptor",100,29290610,XCorr,4.5848789,0.9993000,,,,0.0065419999882579,
MEAMSYEPETNAPSSPYHPAGNRTPERPRK,ph,T,125,true,"TOR Kinase and ABA Receptor",100,29290610,XCorr,3.8786049,0.7866000,,,,0.015230000019073,
MEAMSYEPETNAPSSPYHPAGNRTPERPR,ph,T,125,true,"PAMP-triggered phosphorylation",48,24601666,"MASCOT Score",26.8400000,,,,,,
MEAMSYEPETNAPSSPYHPAGNRTPERPR,ph,T,125,true,"SnRK2 protein kinase substrates",85,23776212,XCorr,4.2605314,0.8210000,,,,2.2641200980028E-12,
MEAMSYEPETNAPSSPYHPAGNRTPERPR,ph,T,125,true,"atm and atr DNA damage response",88,25561503,"MASCOT Score",41.0000000,0.9720000,,,,,-0.4200000
MEAMSYEPETNAPSSPYHPAGNRTPERPR,ph,T,125,true,"TOR Kinase and ABA Receptor",100,29290610,XCorr,4.7910247,0.9516000,,,,6.2150000303518E-5,
MEAMSYEPETNAPSSPYHPAGNRTPERPR,ph,T,125,true,"Tissue atlas Arabidopsis - ProteomicsDB",114,32188942,"MaxQuant score",307.3100000,0.9999810,,,,0,
SNASPFHPFR,ph,S,150,true,"atm and atr DNA damage response",88,25561503,"MASCOT Score",32.0000000,1.0000000,,,,,0.1100000
SNASPFHPFR,ph,S,150,true,"Tissue atlas Arabidopsis - ProteomicsDB",114,32188942,"MaxQuant score",92.1120000,1.0000000,,,,0.00099583598785102,
SNASPFHPFR,ph,S,153,true,"STN8 phosphoproteome",38,21768351,"MASCOT Score",41.4100000,,,,,,-0.0930100
SNASPFHPFR,ph,S,153,true,"Large-scale phosphorylation discovery",44,23111157,XCorr,2.6990000,,,,,,
SNASPFHPFR,ph,S,153,true,"MAPK Arabidopsis substrates",45,23172892,"MaxQuant Score",85.8130000,,,,,,
SNASPFHPFR,ph,S,153,true,"Phosphoproteome ethylene-regulated time response",46,24043427,"MASCOT Score",49.1600000,,,,,,0.7886600
SNASPFHPFR,ph,S,153,true,"Chloroplast kinase substrates",60,19376835,"MASCOT Score",37.8600000,,,,,,-0.4315730
SNASPFHPFR,ph,S,153,true,"atm and atr DNA damage response",88,25561503,"MASCOT Score",42.0000000,1.0000000,,,,,0.2900000
SNASPFHPFR,ph,S,153,true,"TOR Kinase and ABA Receptor",100,29290610,XCorr,3.0073938,1.0000000,,,,0.00074019999010488,
SNASPFHPFR,ph,S,153,true,"Lateral root-induction - NAA vs control",106,23328941,"MASCOT Score",27.0000000,,,,,,
SNASPFHPFR,ph,S,153,true,"Tissue atlas Arabidopsis - ProteomicsDB",114,32188942,"MaxQuant score",210.3100000,1.0000000,,,,6.7084502774415E-20,
SNASPFHPFR,ph,S,153,true,"Touch-induced phosphorylation: 40s touch vs untouc",136,30291188,"MASCOT score",51.7400000,,-0.0647640,0.9168858,NO,,6.4330707
SPSPSPFHTPDR,ph,S,160,true,"Tissue atlas Arabidopsis - ProteomicsDB",114,32188942,"MaxQuant score",143.5000000,0.9937170,,,,4.1961298580357E-33,
SPSPSPFHTPDR,ph,S,162,true,"atm and atr DNA damage response",88,25561503,"MASCOT Score",48.0000000,0.9960000,,,,,0.6900000
SPSPSPFHTPDR,ph,S,162,true,"Lateral root-induction - NAA vs control",106,23328941,"MASCOT Score",23.0000000,,,,,,
SPSPSPFHTPDR,ph,S,162,true,"Tissue atlas Arabidopsis - ProteomicsDB",114,32188942,"MaxQuant score",215.0200000,0.9999700,,,,6.6460895669875E-39,
SPSPSPFHTPDRR,ph,S,164,true,"TOR Kinase and ABA Receptor",100,29290610,XCorr,2.7593079,0.8883000,,,,0.055509999394417,
SPSPSPFHTPDR,ph,S,164,true,"Large-scale phosphorylation discovery",44,23111157,XCorr,3.2660000,,,,,,
SPSPSPFHTPDR,ph,S,164,true,"atm and atr DNA damage response",88,25561503,"MASCOT Score",35.0000000,1.0000000,,,,,-0.0200000
SPSPSPFHTPDR,ph,S,164,true,"Tissue atlas Arabidopsis - ProteomicsDB",114,32188942,"MaxQuant score",106.8200000,0.9974070,,,,2.08041001315E-5,
SPSPSPFHTPDRR,ph,T,168,true,"atm and atr DNA damage response",88,25561503,"MASCOT Score",35.0000000,0.9450000,,,,,-0.4400000
SPSPSPFHTPDR,ph,T,168,true,"atm and atr DNA damage response",88,25561503,"MASCOT Score",31.0000000,1.0000000,,,,,-0.7000000
SPSPSPFHTPDR,ph,T,168,true,"TOR Kinase and ABA Receptor",100,29290610,XCorr,2.9757981,0.9996000,,,,2.2210000679479E-5,
SPSPSPFHTPDR,ph,T,168,true,"Tissue atlas Arabidopsis - ProteomicsDB",114,32188942,"MaxQuant score",177.9300000,0.9999950,,,,3.9550899111611E-19,
RDHYDMYEPEANTMLQNSAPGSPFHPAGSRSPPPYR,ph,S,190,true,"Tissue atlas Arabidopsis - ProteomicsDB",114,32188942,"MaxQuant score",55.3500000,0.7686680,,,,9.6183600817312E-7,
DHYDMYEPEANTMLQNSAPGSPFHPAGSR,ph,S,190,true,"Large-scale phosphorylation discovery",44,23111157,XCorr,4.7410000,,,,,,
RDHYDMYEPEANTMLQNSAPGSPFHPAGSRSPPPYR,ph,S,194,true,"MAPK Arabidopsis substrates",45,23172892,"MaxQuant Score",124.7900000,,,,,,
RDHYDMYEPEANTMLQNSAPGSPFHPAGSRSPPPYR,ph,S,194,true,"TOR Kinase and ABA Receptor",100,29290610,XCorr,4.7409673,0.9077000,,,,0.00052350002806634,
DHYDMYEPEANTMLQNSAPGSPFHPAGSR,ph,S,194,true,"Large-scale phosphorylation discovery",44,23111157,XCorr,6.0730000,,,,,,
DHYDMYEPEANTMLQNSAPGSPFHPAGSR,ph,S,194,true,"TOR Kinase and ABA Receptor",100,29290610,XCorr,5.8938518,0.9990000,,,,5.539000085264E-6,
DHYDMYEPEANTMLQNSAPGSPFHPAGSR,ph,S,194,true,"Lateral root-induction - NAA vs control",106,23328941,"MASCOT Score",35.0000000,,,,,,
DHYDMYEPEANTMLQNSAPGSPFHPAGSR,ph,S,194,true,"Tissue atlas Arabidopsis - ProteomicsDB",114,32188942,"MaxQuant score",343.9600000,0.9998310,,,,0,
RDHYDMYEPEANTMLQNSAPGSPFHPAGSRSPPPYR,ph,S,201,true,"MAPK Arabidopsis substrates",45,23172892,"MaxQuant Score",124.7900000,,,,,,
DHYDMYEPEANTMLQNSAPGSPFHPAGSRSPPPYR,ph,S,201,true,"SnRK2 protein kinase substrates",85,23776212,XCorr,3.6964526,0.7940000,,,,3.4003300175556E-11,
DHYDMYEPEANTMLQNSAPGSPFHPAGSRSPPPYR,ph,S,201,true,"TOR Kinase and ABA Receptor",100,29290610,XCorr,5.2630677,0.8060000,,,,0.00045910000335425,
DHYDMYEPEANTMLQNSAPGSPFHPAGSRSPPPYR,ph,S,203,true,"SnRK2 protein kinase substrates",85,23776212,XCorr,3.6964526,0.7940000,,,,3.4003300175556E-11,
DHYDMYEPEANTMLQNSAPGSPFHPAGSRSPPPYR,ph,S,203,true,"TOR Kinase and ABA Receptor",100,29290610,XCorr,5.2630677,0.9484000,,,,0.00045910000335425,
SPPPYRTPDRR,ph,S,203,true,"srk2dei ABA signaling phopshoproteomics",83,23572148,"MASCOT Score",26.0000000,,,,,,-0.0013000
SPPPYRTPDRR,ph,S,203,true,"Tissue atlas Arabidopsis - ProteomicsDB",114,32188942,"MaxQuant score",161.6600000,0.9999990,,,,0,
SPPPYRTPDR,ph,S,203,true,"atm and atr DNA damage response",88,25561503,"MASCOT Score",30.0000000,0.9920000,,,,,-0.0500000
SPPPYRTPDRR,ph,T,209,true,"srk2dei ABA signaling phopshoproteomics",83,23572148,"MASCOT Score",26.0000000,,,,,,-0.0013000
SPPPYRTPDRR,ph,T,209,true,"TOR Kinase and ABA Receptor",100,29290610,XCorr,2.2390671,0.9926000,,,,0.012020000256598,
SPPPYRTPDRR,ph,T,209,true,"Tissue atlas Arabidopsis - ProteomicsDB",114,32188942,"MaxQuant score",81.4480000,0.9998900,,,,0.00075325201032683,
SPPPYRTPDR,ph,T,209,true,"atm and atr DNA damage response",88,25561503,"MASCOT Score",30.0000000,0.9180000,,,,,-0.0500000
SNYDKEQFEDLYEQDGDVTPR,ph,S,214,true,"Large-scale phosphorylation discovery",44,23111157,XCorr,3.7210000,,,,,,
SNYDKEQFEDLYEQDGDVTPR,ph,S,214,true,"Tissue atlas Arabidopsis - ProteomicsDB",114,32188942,"MaxQuant score",159.8900000,1.0000000,,,,1.3305699290178E-29,
EQFEDLYEQDGDVTPRNSSPPSPFHPAAYK,ph,T,232,true,"srk2dei ABA signaling phopshoproteomics",83,23572148,"MASCOT Score",48.0000000,,,,,,-0.0049000
EQFEDLYEQDGDVTPRNSSPPSPFHPAAYK,ph,T,232,true,"Brassinosteroid-Regulated Phosphorylation Dynamics",94,26187819,"MaxQuant Score",71.4700000,0.9950000,,,,0.0020000000949949,1.7720000
EQFEDLYEQDGDVTPRNSSPPSPFHPAAYK,ph,T,232,true,"TOR Kinase and ABA Receptor",100,29290610,XCorr,4.4819722,0.9622000,,,,0.020330000668764,
SNYDKEQFEDLYEQDGDVTPR,ph,T,232,true,"Arabidopsis root NAA phosphoproteome",18a,27643528,"MaxQuant Score",83.8790000,1.0000000,,,,2.9049999739073E-8,0.2330000
SNYDKEQFEDLYEQDGDVTPR,ph,T,232,true,"STN8 phosphoproteome",38,21768351,"MASCOT Score",87.6200000,,,,,,-2.1124400
SNYDKEQFEDLYEQDGDVTPR,ph,T,232,true,"Phosphoproteome iron-deficient Arabidopsis roots",41,22438062,"MASCOT Score",77.2300000,,,,,,
SNYDKEQFEDLYEQDGDVTPR,ph,T,232,true,"PAMP-triggered phosphorylation",48,24601666,"MASCOT Score",28.1600000,,,,,,
SNYDKEQFEDLYEQDGDVTPR,ph,T,232,true,"Chloroplast kinase substrates",60,19376835,"MASCOT Score",68.2300000,,,,,,-0.8235130
SNYDKEQFEDLYEQDGDVTPR,ph,T,232,true,"LAXIC - ABA stress",84a,23660473,XCorr,5.3600000,1.0000000,,,,0.00011618300050031,
SNYDKEQFEDLYEQDGDVTPR,ph,T,232,true,"LAXIC - mannitol vs control",84b,23660473,XCorr,5.1500000,1.0000000,1.0987575,,NO,2.3399999386081E-12,
SNYDKEQFEDLYEQDGDVTPR,ph,T,232,true,"SnRK2 protein kinase substrates",85,23776212,XCorr,5.4325471,1.0000000,,,,3.96250006599E-16,
SNYDKEQFEDLYEQDGDVTPR,ph,T,232,true,"Phospho cell culture sucrose/TOR",109,30833711,,,0.9993890,,,,,
SNYDKEQFEDLYEQDGDVTPR,ph,T,232,true,"Col-0 callus - FC Col-0 vs. Col-0 Xray",111a,31410901,,41.8000000,,0.8121768,0.0465625,YES,,1.1170589
SNYDKEQFEDLYEQDGDVTPR,ph,T,232,true,"Col-0 X-ray callus - FC Col-0 vs. Col-0 Xray",111b,31410901,,41.8000000,,0.8121768,0.0465625,YES,,1.1170589
SNYDKEQFEDLYEQDGDVTPR,ph,T,232,true,"atm callus - FC atm vs. atm Xray",111c,31410901,,41.8000000,,0.7923903,0.0278294,YES,,1.1170589
SNYDKEQFEDLYEQDGDVTPR,ph,T,232,true,"atm-3 X-ray callus - FC atm vs. atm Xray",111d,31410901,,41.8000000,,0.7923903,0.0278294,YES,,1.1170589
SNYDKEQFEDLYEQDGDVTPR,ph,T,232,true,"Tissue atlas Arabidopsis - ProteomicsDB",114,32188942,"MaxQuant score",331.3800000,1.0000000,,,,0,
SNYDKEQFEDLYEQDGDVTPR,ph,T,232,true,"Touch-induced phosphorylation: 40s touch vs untouc",136,30291188,"MASCOT score",103.1000000,,-0.0421107,0.3697345,NO,,1.1090773
EQFEDLYEQDGDVTPR,ph,T,232,true,"STN8 phosphoproteome",38,21768351,"MASCOT Score",83.0100000,,,,,,-1.0611100
EQFEDLYEQDGDVTPR,ph,T,232,true,"Large-scale phosphorylation discovery",44,23111157,XCorr,5.3460000,,,,,,
EQFEDLYEQDGDVTPR,ph,T,232,true,"Chloroplast kinase substrates",60,19376835,"MASCOT Score",70.8800000,,,,,,-1.0611100
EQFEDLYEQDGDVTPR,ph,T,232,true,"BSK8 and BSL2 regulating sucrose-ph synthase",66,24924143,"MaxQuant Score",186.1500000,,,,,,-0.8167600
EQFEDLYEQDGDVTPR,ph,T,232,true,"srk2dei ABA signaling phopshoproteomics",83,23572148,"MASCOT Score",86.0000000,,,,,,-0.0003000
EQFEDLYEQDGDVTPR,ph,T,232,true,"LAXIC - ABA stress",84a,23660473,XCorr,3.8300000,1.0000000,,,,0.0026163100264966,
EQFEDLYEQDGDVTPR,ph,T,232,true,"SnRK2 protein kinase substrates",85,23776212,XCorr,4.0391459,1.0000000,,,,2.8522499032763E-12,
EQFEDLYEQDGDVTPR,ph,T,232,true,"TOR Kinase and ABA Receptor",100,29290610,XCorr,5.3164825,1.0000000,,,,1.139999994848E-6,
EQFEDLYEQDGDVTPR,ph,T,232,true,"Lateral root-induction - NAA vs control",106,23328941,"MASCOT Score",56.0000000,,,,,,
EQFEDLYEQDGDVTPRNSSPPSPFHPAAYK,ph,S,236,true,"srk2dei ABA signaling phopshoproteomics",83,23572148,"MASCOT Score",48.0000000,,,,,,-0.0049000
EQFEDLYEQDGDVTPRNSSPPSPFHPAAYK,ph,S,236,true,"Brassinosteroid-Regulated Phosphorylation Dynamics",94,26187819,"MaxQuant Score",71.4700000,0.8310000,,,,0.0020000000949949,2.3530000
NSSPPSPFHPAAYK,ph,S,236,true,"STN8 phosphoproteome",38,21768351,"MASCOT Score",42.1600000,,,,,,
NSSPPSPFHPAAYK,ph,S,236,true,"MAPK Arabidopsis substrates",45,23172892,"MaxQuant Score",45.2800000,,,,,,
NSSPPSPFHPAAYK,ph,S,236,true,"srk2dei ABA signaling phopshoproteomics",83,23572148,"MASCOT Score",43.0000000,,,,,,0.0014000
NSSPPSPFHPAAYK,ph,S,236,true,"atm and atr DNA damage response",88,25561503,"MASCOT Score",42.0000000,0.9940000,,,,,0.8500000
NSSPPSPFHPAAYK,ph,S,236,true,"Lateral root-induction - NAA vs control",106,23328941,"MASCOT Score",23.0000000,,,,,,
NSSPPSPFHPAAYK,ph,S,236,true,"Tissue atlas Arabidopsis - ProteomicsDB",114,32188942,"MaxQuant score",191.5100000,0.9986670,,,,1.6481299488854E-31,
EQFEDLYEQDGDVTPRNSSPPSPFHPAAYK,ph,S,237,true,"Brassinosteroid-Regulated Phosphorylation Dynamics",94,26187819,"MaxQuant Score",71.4700000,0.8300000,,,,0.0020000000949949,2.3530000
EQFEDLYEQDGDVTPRNSSPPSPFHPAAYK,ph,S,237,true,"TOR Kinase and ABA Receptor",100,29290610,XCorr,4.4819722,0.8204000,,,,0.020330000668764,
NSSPPSPFHPAAYK,ph,S,237,true,"srk2dei ABA signaling phopshoproteomics",83,23572148,"MASCOT Score",42.0000000,,,,,,-0.0005000
NSSPPSPFHPAAYK,ph,S,237,true,"LAXIC - mannitol vs control",84b,23660473,XCorr,3.0300000,0.8890000,,,,0.027122700586915,
NSSPPSPFHPAAYK,ph,S,237,true,"atm and atr DNA damage response",88,25561503,"MASCOT Score",42.0000000,0.9420000,,,,,0.2300000
NSSPPSPFHPAAYK,ph,S,237,true,"TOR Kinase and ABA Receptor",100,29290610,XCorr,3.3795269,0.9428000,,,,0.0035319998860359,
NSSPPSPFHPAAYK,ph,S,237,true,"Lateral root-induction - NAA vs control",106,23328941,"MASCOT Score",29.0000000,,,,,,
NSSPPSPFHPAAYK,ph,S,237,true,"Phospho cell culture sucrose/TOR",109,30833711,,,0.9523740,,,,,
NSSPPSPFHPAAYK,ph,S,237,true,"Tissue atlas Arabidopsis - ProteomicsDB",114,32188942,"MaxQuant score",168.4500000,0.9990240,,,,1.3140400099209E-15,
EQFEDLYEQDGDVTPRNSSPPSPFHPAAYK,ph,S,240,true,"srk2dei ABA signaling phopshoproteomics",83,23572148,"MASCOT Score",48.0000000,,,,,,-0.0049000
EQFEDLYEQDGDVTPRNSSPPSPFHPAAYK,ph,S,240,true,"Brassinosteroid-Regulated Phosphorylation Dynamics",94,26187819,"MaxQuant Score",71.4700000,0.9570000,,,,0.0020000000949949,-0.0700000
EQFEDLYEQDGDVTPRNSSPPSPFHPAAYK,ph,S,240,true,"TOR Kinase and ABA Receptor",100,29290610,XCorr,4.4819722,0.8405000,,,,0.020330000668764,
NSSPPSPFHPAAYK,ph,S,240,true,"STN8 phosphoproteome",38,21768351,"MASCOT Score",42.7100000,,,,,,-1.5913100
NSSPPSPFHPAAYK,ph,S,240,true,"Large-scale phosphorylation discovery",44,23111157,XCorr,3.2270000,,,,,,
NSSPPSPFHPAAYK,ph,S,240,true,"MAPK Arabidopsis substrates",45,23172892,"MaxQuant Score",141.3400000,,,,,,
NSSPPSPFHPAAYK,ph,S,240,true,"Phosphoproteome ethylene-regulated time response",46,24043427,"MASCOT Score",55.0400000,,,,,,0.3428100
NSSPPSPFHPAAYK,ph,S,240,true,"Chloroplast kinase substrates",60,19376835,"MASCOT Score",44.6000000,,,,,,-0.7941930
NSSPPSPFHPAAYK,ph,S,240,true,"srk2dei ABA signaling phopshoproteomics",83,23572148,"MASCOT Score",43.0000000,,,,,,0.0014000
NSSPPSPFHPAAYK,ph,S,240,true,"LAXIC - mannitol vs control",84b,23660473,XCorr,3.0300000,1.0000000,,,,0.027122700586915,
NSSPPSPFHPAAYK,ph,S,240,true,"SnRK2 protein kinase substrates",85,23776212,XCorr,3.3302445,1.0000000,,,,0.023690300062299,
NSSPPSPFHPAAYK,ph,S,240,true,"atm and atr DNA damage response",88,25561503,"MASCOT Score",64.0000000,1.0000000,,,,,-0.0700000
NSSPPSPFHPAAYK,ph,S,240,true,"TOR Kinase and ABA Receptor",100,29290610,XCorr,3.3795269,1.0000000,,,,0.0035319998860359,
NSSPPSPFHPAAYK,ph,S,240,true,"Lateral root-induction - NAA vs control",106,23328941,"MASCOT Score",36.0000000,,,,,,
NSSPPSPFHPAAYK,ph,S,240,true,"Phospho cell culture sucrose/TOR",109,30833711,,,0.9999430,,,,,
NSSPPSPFHPAAYK,ph,S,240,true,"Tissue atlas Arabidopsis - ProteomicsDB",114,32188942,"MaxQuant score",196.4700000,1.0000000,,,,1.0094899806542E-31,
NSSPPSPFHPAAYK,ph,Y,247,true,"srk2dei ABA signaling phopshoproteomics",83,23572148,"MASCOT Score",22.0000000,,,,,,0.0003000
TSDQRSNHGKEQIEDFYEQDDDVTPR,ph,S,254,true,"PAMP-triggered phosphorylation",48,24601666,"MASCOT Score",48.5900000,,,,,,
SNHGKEQIEDFYEQDDDVTPR,ph,S,254,true,"STN8 phosphoproteome",38,21768351,"MASCOT Score",83.6000000,,,,,,
SNHGKEQIEDFYEQDDDVTPR,ph,S,254,true,"SnRK2 protein kinase substrates",85,23776212,XCorr,3.7344046,1.0000000,,,,1.204019994816E-8,
SNHGKEQIEDFYEQDDDVTPR,ph,S,254,true,"Tissue atlas Arabidopsis - ProteomicsDB",114,32188942,"MaxQuant score",120.1300000,1.0000000,,,,3.9412798723406E-18,
EQIEDFYEQDDDVTPRNSSPPSPLHPAASHSPPPPQPYR,ph,T,272,true,"TOR Kinase and ABA Receptor",100,29290610,XCorr,4.9187064,0.9285000,,,,0.0027320000808686,
SNHGKEQIEDFYEQDDDVTPR,ph,T,272,true,"STN8 phosphoproteome",38,21768351,"MASCOT Score",72.2400000,,,,,,-0.8317360
SNHGKEQIEDFYEQDDDVTPR,ph,T,272,true,"SnRK2 protein kinase substrates",85,23776212,XCorr,3.7344046,1.0000000,,,,1.204019994816E-8,
EQIEDFYEQDDDVTPR,ph,T,272,true,"STN8 phosphoproteome",38,21768351,"MASCOT Score",90.9100000,,,,,,-1.4743400
EQIEDFYEQDDDVTPR,ph,T,272,true,"Large-scale phosphorylation discovery",44,23111157,XCorr,5.4820000,,,,,,
EQIEDFYEQDDDVTPR,ph,T,272,true,"Chloroplast kinase substrates",60,19376835,"MASCOT Score",63.1000000,,,,,,-1.9551500
EQIEDFYEQDDDVTPR,ph,T,272,true,"BSK8 and BSL2 regulating sucrose-ph synthase",66,24924143,"MaxQuant Score",215.6500000,,,,,,0.5383300
EQIEDFYEQDDDVTPR,ph,T,272,true,"srk2dei ABA signaling phopshoproteomics",83,23572148,"MASCOT Score",90.0000000,,,,,,-0.0005000
EQIEDFYEQDDDVTPR,ph,T,272,true,"LAXIC - ABA stress",84a,23660473,XCorr,5.3500000,1.0000000,,,,0.0012974999845028,
EQIEDFYEQDDDVTPR,ph,T,272,true,"LAXIC - mannitol vs control",84b,23660473,XCorr,4.3900000,1.0000000,,,,1.700000029814E-5,
EQIEDFYEQDDDVTPR,ph,T,272,true,"SnRK2 protein kinase substrates",85,23776212,XCorr,4.4953218,1.0000000,,,,4.431970068719E-10,
EQIEDFYEQDDDVTPR,ph,T,272,true,"atm and atr DNA damage response",88,25561503,"MASCOT Score",34.0000000,1.0000000,,,,,-0.1200000
EQIEDFYEQDDDVTPR,ph,T,272,true,"TOR Kinase and ABA Receptor",100,29290610,XCorr,5.2640982,1.0000000,,,,3.01899990518E-6,
EQIEDFYEQDDDVTPR,ph,T,272,true,"Lateral root-induction - NAA vs control",106,23328941,"MASCOT Score",70.0000000,,,,,,
EQIEDFYEQDDDVTPR,ph,T,272,true,"Col-0 callus - FC Col-0 vs. Col-0 Xray",111a,31410901,,103.7000000,,0.6575863,0.0000000,NO,,1.0783604
EQIEDFYEQDDDVTPR,ph,T,272,true,"Col-0 X-ray callus - FC Col-0 vs. Col-0 Xray",111b,31410901,,103.7000000,,0.6575863,0.0000000,NO,,1.0783604
EQIEDFYEQDDDVTPR,ph,T,272,true,"atm callus - FC atm vs. atm Xray",111c,31410901,,103.7000000,,0.9869649,0.0000000,NO,,1.0783604
EQIEDFYEQDDDVTPR,ph,T,272,true,"atm-3 X-ray callus - FC atm vs. atm Xray",111d,31410901,,103.7000000,,0.9869649,0.0000000,NO,,1.0783604
EQIEDFYEQDDDVTPR,ph,T,272,true,"Tissue atlas Arabidopsis - ProteomicsDB",114,32188942,"MaxQuant score",363.8700000,1.0000000,,,,0,