Peptide,PTM,ModifiedAA,ModifiedPosition,PeptideUniqueToGene,ExperimentDesc,ExpID,PubmedID,ScoreType,IdentScore,LocProb,Log2FChange,PQ-val,QuantSig,PEP,MassErrorPPM
VMEDNESCASR,nt,V,2,true,"Arg/N-end rule pathway Roots",80,25728785,"MASCOT Score",45.6800000,,,,,0.011819999665022,
VMEDNESCASR,nt,V,2,true,"Tic56 chloroplast import - tic56-1",89c,25588737,XCorr,2.8728952,,,,,,
VMEDNESCASR,nt,V,2,true,"Arg/N-end rule seed, prt6 vs. Wt",99,29168982,"MASCOT Score",45.3700000,,0.0124161,0.8958264,NO,0.0053969998843968,-1.8831867
MEDNESCASR,nt,M,3,true,"Arg/N-end rule seed, prt6 vs. Wt",99,29168982,"MASCOT Score",55.7700000,,,,,0.019619999453425,-0.3803461
MEDNESCASR,nta,M,3,true,"Arg/N-end rule seed, prt6 vs. Wt",99,29168982,"MASCOT Score",55.7700000,,,,,0.019619999453425,-0.3803461
VIFDALPTSQATMDRR,ph,T,20,true,"Tissue atlas Arabidopsis - ProteomicsDB",114,32188942,"MaxQuant score",93.3710000,0.7940800,,,,1.2610200428753E-5,
VIFDALPTSQATMDRR,ph,T,24,true,"Tissue atlas Arabidopsis - ProteomicsDB",114,32188942,"MaxQuant score",76.0270000,0.8077590,,,,9.9848301033489E-5,
AEDVLMHKR,ac,K,87,true,"Quantitative Acetylproteomics",101,29440448,,,,,,,,
LLHSAYDPQNRPAIEVHLVQVQPAGISADLDSTSNDAGHSSPTRK,ph,S,122,true,"MAPK Arabidopsis substrates",45,23172892,"MaxQuant Score",44.4390000,,,,,,
LLHSAYDPQNRPAIEVHLVQVQPAGISADLDSTSNDAGHSSPTRK,ph,S,128,true,"MAPK Arabidopsis substrates",45,23172892,"MaxQuant Score",82.9920000,,,,,,
LLHSAYDPQNRPAIEVHLVQVQPAGISADLDSTSNDAGHSSPTR,ph,S,128,true,"MAPK Arabidopsis substrates",45,23172892,"MaxQuant Score",82.7890000,,,,,,
LLHSAYDPQNRPAIEVHLVQVQPAGISADLDSTSNDAGHSSPTRK,ph,S,129,true,"MAPK Arabidopsis substrates",45,23172892,"MaxQuant Score",105.6400000,,,,,,
LLHSAYDPQNRPAIEVHLVQVQPAGISADLDSTSNDAGHSSPTR,ph,S,129,true,"MAPK Arabidopsis substrates",45,23172892,"MaxQuant Score",81.8330000,,,,,,
IELQSQSWPMQQSFSPEK,ph,S,251,true,"Tissue atlas Arabidopsis - ProteomicsDB",114,32188942,"MaxQuant score",140.2800000,0.9988790,,,,1.1480500337419E-15,
IELQSQSWPMQQSFSPEK,ph,S,257,true,"TOR Kinase and ABA Receptor",100,29290610,XCorr,4.5931425,0.9329000,,,,1.3230000206477E-7,
IELQSQSWPMQQSFSPEK,ph,S,257,true,"Tissue atlas Arabidopsis - ProteomicsDB",114,32188942,"MaxQuant score",134.8500000,0.8803150,,,,1.161700045529E-21,
IELQSQSWPMQQSFSPEKENGQTGAR,ph,S,259,true,"PAMP-triggered phosphorylation",48,24601666,"MASCOT Score",38.5800000,,,,,,
IELQSQSWPMQQSFSPEKENGQTGAR,ph,S,259,true,"LAXIC - ABA stress",84a,23660473,XCorr,4.8800000,0.9410000,,,,0.0057828798890114,
IELQSQSWPMQQSFSPEKENGQTGAR,ph,S,259,true,"SnRK2 protein kinase substrates",85,23776212,XCorr,4.8747978,0.9870000,,,,3.6455201524177E-8,
IELQSQSWPMQQSFSPEKENGQTGAR,ph,S,259,true,"Phospho cell culture sucrose/TOR",109,30833711,,,0.9793580,,,,,
IELQSQSWPMQQSFSPEKENGQTGAR,ph,S,259,true,"Tissue atlas Arabidopsis - ProteomicsDB",114,32188942,"MaxQuant score",268.2300000,0.9992120,,,,0,
IELQSQSWPMQQSFSPEK,ph,S,259,true,"srk2dei ABA signaling phopshoproteomics",83,23572148,"MASCOT Score",58.0000000,,,,,,0.0011000
IELQSQSWPMQQSFSPEK,ph,S,259,true,"TOR Kinase and ABA Receptor",100,29290610,XCorr,4.5998702,0.9847000,,,,1.7829999706009E-5,
IELQSQSWPMQQSFSPEK,ph,S,259,true,"Lateral root-induction - NAA vs control",106,23328941,"MASCOT Score",29.0000000,,,,,,
IASGSYGDLYK,ph,S,300,true,"Tissue atlas Arabidopsis - ProteomicsDB",114,32188942,"MaxQuant score",105.6500000,0.9985820,,,,4.574090053211E-5,
GTYCSQEVAIK,so,C,310,false,"Arabidopsis S-sulfenylation chemoproteomics",108,31578252,"pFind PSM Score",0.0339827,,0.9523800,,,,0.3586551
VAIDICK,sno,C,396,true,"hot5-4 / wildtype, FAT-switch S-nitrosoproteome",169,37277371,,,,,,,,
VKAQTGVMTAETGTYR,ph,T,443,true,"MAPK Arabidopsis substrates",45,23172892,"MaxQuant Score",149.0000000,,,,,,
VKAQTGVMTAETGTYR,ph,T,443,true,"SnRK2 protein kinase substrates",85,23776212,XCorr,2.7241848,0.9990000,,,,6.2236198417054E-9,
AQTGVMTAETGTYR,ph,T,443,true,"Arabidopsis root NAA phosphoproteome",18a,27643528,"MaxQuant Score",74.7320000,0.9810000,,,,1.5550000398434E-7,-0.0620000
AQTGVMTAETGTYR,ph,T,443,true,"Ph protein kinases and peptide chip analysis",27,18433157,,,,,,,,
AQTGVMTAETGTYR,ph,T,443,true,"Phosphorylation nuclei-enriched fractions",28,19245862,,,,,,,,
AQTGVMTAETGTYR,ph,T,443,true,"STN8 phosphoproteome",38,21768351,"MASCOT Score",74.6800000,,,,,,-0.8466230
AQTGVMTAETGTYR,ph,T,443,true,"PAMP-triggered phosphorylation",48,24601666,"MASCOT Score",25.8300000,,,,,,
AQTGVMTAETGTYR,ph,T,443,true,"Tyrosine phosphorylation in Arabidopsis",59,18463617,"MASCOT Score",54.0000000,,,,,,0.8947627
AQTGVMTAETGTYR,ph,T,443,true,"Chloroplast kinase substrates",60,19376835,"MASCOT Score",75.3300000,,,,,,-0.8466230
AQTGVMTAETGTYR,ph,T,443,true,"srk2dei ABA signaling phopshoproteomics",83,23572148,"MASCOT Score",92.0000000,,,,,,-0.0003000
AQTGVMTAETGTYR,ph,T,443,true,"SnRK2 protein kinase substrates",85,23776212,XCorr,4.0283828,1.0000000,,,,0.0022380899172276,
AQTGVMTAETGTYR,ph,T,443,true,"SIRK1 phosphorylation",86a,23820729,"MaxQuant Score",182.3300000,1.0000000,,,,9.7199995252595E-7,4.0510000
AQTGVMTAETGTYR,ph,T,443,true,"SIRK1 exp - sirk1 mutant vs WT",86b,23820729,,,,0.1201238,,NO,,
AQTGVMTAETGTYR,ph,T,443,true,"SIRK1 exp - 35S:SIRK1 vs WT",86c,23820729,,,,0.6321611,,NO,,
AQTGVMTAETGTYR,ph,T,443,true,"atm and atr DNA damage response",88,25561503,"MASCOT Score",82.0000000,0.9960000,,,,,0.3900000
AQTGVMTAETGTYR,ph,T,443,true,"Protein sumoylation and phosphorylation cross-talk",97,28419593,,,,,,,,
AQTGVMTAETGTYR,ph,T,443,true,"TOR Kinase and ABA Receptor",100,29290610,XCorr,5.2064133,0.9992000,,,,4.9139998736791E-8,
AQTGVMTAETGTYR,ph,T,443,true,"Lateral root-induction - NAA vs control",106,23328941,"MASCOT Score",70.0000000,,,,,,
AQTGVMTAETGTYR,ph,T,443,true,"Phospho cell culture sucrose/TOR",109,30833711,,,0.9997550,,,,,
AQTGVMTAETGTYR,ph,T,443,true,"Tissue atlas Arabidopsis - ProteomicsDB",114,32188942,"MaxQuant score",308.3600000,1.0000000,,,,0,
AQTGVMTAETGTYR,ph,T,446,true,"srk2dei ABA signaling phopshoproteomics",83,23572148,"MASCOT Score",28.0000000,,,,,,0.0006000
