Peptide,PTM,ModifiedAA,ModifiedPosition,PeptideUniqueToGene,ExperimentDesc,ExpID,PubmedID,ScoreType,IdentScore,LocProb,Log2FChange,PQ-val,QuantSig,PEP,MassErrorPPM
MDTGGNSLASGPDGVKRKVCYFYDPE,nta,M,1,true,"HUNTER N-terminome: legumain, GluC and trypsin",119,31951383,"MaxQuant score",,,,,,,
MDTGGNSLASGPDGVKRKVCY,nta,M,1,true,"Arabidopsis translation initiation landscape - NTA",167a,35069635,,,,,,,,
MDTGGNSLASGPDGVKR,nta,M,1,true,"Arg/N-end rule pathway Roots",80,25728785,"MASCOT Score",85.3600000,,,,,4.1900001690465E-8,
MDTGGNSLASGPDGVKR,nta,M,1,true,"HUNTER N-terminome: legumain, GluC and trypsin",119,31951383,"MaxQuant score",78.9640000,,,,,,
MDTGGNSLAS,nta,M,1,true,"N-term acetylation drought responses",5,26184543,,,,,,,,
MDTGGNSLASGPDGVKR,ph,S,7,true,"Tissue atlas Arabidopsis - ProteomicsDB",114,32188942,"MaxQuant score",103.8800000,0.9996070,,,,2.6083799298249E-7,
DTGGNSLASGPDGVKR,ph,S,10,true,"Tissue atlas Arabidopsis - ProteomicsDB",114,32188942,"MaxQuant score",53.2110000,0.9998790,,,,0.0025808699429035,
LNHGLCDIAINWAGGLHHAK,ox,C,137,true,"OxiTRAQ SA and flg22 responses - SA vs mock",91a,25720653,"MASCOT Score",50.0800000,,1.4329594,0.0070000,YES,,
LNHGLCDIAINWAGGLHHAK,ox,C,137,true,"OxiTRAQ SA and flg22 responses - flg22 vs mock",91b,25720653,"MASCOT Score",50.0800000,,0.8953026,0.4510000,NO,,
LCDIAINWAGGLHHAK,ox,C,137,false,"OxiTRAQ SA and flg22 responses - SA vs mock",91a,25720653,"MASCOT Score",48.7800000,,0.8399596,0.0360000,YES,,
LCDIAINWAGGLHHAK,ox,C,137,false,"OxiTRAQ SA and flg22 responses - flg22 vs mock",91b,25720653,"MASCOT Score",48.7800000,,0.8399596,0.0800000,NO,,
LQHAPSVPFQERPPDTETPEVDEDQEDGDKR,ph,S,386,true,"Tissue atlas Arabidopsis - ProteomicsDB",114,32188942,"MaxQuant score",86.7220000,0.9883640,,,,1.7418299500554E-17,
LQHAPSVPFQERPPDTETPEVDEDQEDGDKR,ph,T,398,true,"Tissue atlas Arabidopsis - ProteomicsDB",114,32188942,"MaxQuant score",239.8400000,0.9903330,,,,0,
RWDPDSDMDVDDDRKPIPSR,ph,S,416,true,"srk2dei ABA signaling phopshoproteomics",83,23572148,"MASCOT Score",69.0000000,,,,,,0.0022000
RWDPDSDMDVDDDRKPIPSR,ph,S,416,true,"TOR Kinase and ABA Receptor",100,29290610,XCorr,5.9865956,1.0000000,,,,2.0540000256197E-10,
WDPDSDMDVDDDRKPIPSR,ph,S,416,true,"STN8 phosphoproteome",38,21768351,"MASCOT Score",79.4500000,,,,,,-0.8863440
WDPDSDMDVDDDRKPIPSR,ph,S,416,true,"Large-scale phosphorylation discovery",44,23111157,XCorr,4.2760000,,,,,,
WDPDSDMDVDDDRKPIPSR,ph,S,416,true,"PAMP-triggered phosphorylation",48,24601666,"MASCOT Score",28.6700000,,,,,,
WDPDSDMDVDDDRKPIPSR,ph,S,416,true,"Chloroplast kinase substrates",60,19376835,"MASCOT Score",77.1900000,,,,,,-0.8863440
WDPDSDMDVDDDRKPIPSR,ph,S,416,true,"Conserved plant phosphoproteome - Arabidopsis",61a,20466843,"MASCOT Score",60.0000000,1.0000000,,,,,
WDPDSDMDVDDDRKPIPSR,ph,S,416,true,"srk2dei ABA signaling phopshoproteomics",83,23572148,"MASCOT Score",53.0000000,,,,,,-0.0011000
WDPDSDMDVDDDRKPIPSR,ph,S,416,true,"LAXIC - mannitol vs control",84b,23660473,XCorr,3.8900000,1.0000000,,,,0.00041881398647092,
WDPDSDMDVDDDRKPIPSR,ph,S,416,true,"SnRK2 protein kinase substrates",85,23776212,XCorr,4.1157956,1.0000000,,,,5.8221401559422E-5,
WDPDSDMDVDDDRKPIPSR,ph,S,416,true,"atm and atr DNA damage response",88,25561503,"MASCOT Score",35.0000000,1.0000000,,,,,-1.3400000
WDPDSDMDVDDDRKPIPSR,ph,S,416,true,"Phospho cell culture sucrose/TOR",109,30833711,,,1.0000000,,,,,
WDPDSDMDVDDDRKPIPSR,ph,S,416,true,"Col-0 callus - FC Col-0 vs. Col-0 Xray",111a,31410901,,38.0700000,,0.8061639,0.0000000,NO,,1.2265183
WDPDSDMDVDDDRKPIPSR,ph,S,416,true,"Col-0 X-ray callus - FC Col-0 vs. Col-0 Xray",111b,31410901,,38.0700000,,0.8061639,0.0000000,NO,,1.2265183
WDPDSDMDVDDDRKPIPSR,ph,S,416,true,"atm callus - FC atm vs. atm Xray",111c,31410901,,38.0700000,,1.0636063,0.0000000,NO,,1.2265183
WDPDSDMDVDDDRKPIPSR,ph,S,416,true,"atm-3 X-ray callus - FC atm vs. atm Xray",111d,31410901,,38.0700000,,1.0636063,0.0000000,NO,,1.2265183
WDPDSDMDVDDDRKPIPSR,ph,S,416,true,"Tissue atlas Arabidopsis - ProteomicsDB",114,32188942,"MaxQuant score",241.1300000,1.0000000,,,,0,
WDPDSDMDVDDDR,ph,S,416,true,"atm and atr DNA damage response",88,25561503,"MASCOT Score",57.0000000,1.0000000,,,,,-0.2000000
VTGVNPVGVEEASVK,ph,S,480,true,"Tissue atlas Arabidopsis - ProteomicsDB",114,32188942,"MaxQuant score",166.3700000,1.0000000,,,,1.2484100145045E-17,
