Peptide,PTM,ModifiedAA,ModifiedPosition,PeptideUniqueToGene,ExperimentDesc,ExpID,PubmedID,ScoreType,IdentScore,LocProb,Log2FChange,PQ-val,QuantSig,PEP,MassErrorPPM
GKVLEKEAFGLAAKDESGILSPFSFSR,nt,G,2,true,"Stromal N-terminome",96,26371235,"MASCOT Score",60.9300000,,,,,,
GKVLEKEAFG,nt,G,2,true,"N-term acetylation drought responses",5,26184543,,,,,,,,
GKVLEKEAFGLAAKDESGILSPFSFSR,nta,G,2,true,"Stromal N-terminome",96,26371235,"MASCOT Score",60.9300000,,,,,,
GKVLEKEAFG,nta,G,2,true,"N-term acetylation drought responses",5,26184543,,,,,,,,
DESGILSPFSFSR,ph,S,22,true,"srk2dei ABA signaling phopshoproteomics",83,23572148,"MASCOT Score",65.0000000,,,,,,-0.0011000
DESGILSPFSFSR,ph,S,22,true,"atm and atr DNA damage response",88,25561503,"MASCOT Score",63.0000000,0.9990000,,,,,0.0500000
DESGILSPFSFSR,ph,S,22,true,"TOR Kinase and ABA Receptor",100,29290610,XCorr,4.1935797,0.9995000,,,,9.5939998573158E-5,
SCDSCNDGDENYCPK,sno,C,102,true,"Site-specific nitrosomeproteomic id - gsnor1-3",90a,25699590,XCorr,3.7162654,,,,,9.6950003580787E-9,-3.9693735
SCDSCNDGDENYCPK,sno,C,102,true,"Site-specific nitrosomeproteomic id - gsnor1-3",90b,25699590,XCorr,2.0200000,,,,,0.050340000540018,-2.6500000
MILTSGAK,mox,M,116,true,"cat2 Methionine oxidation - 3h stress",62b,25693801,"MASCOT Score",63.0000000,,0.0734965,,NO,,
NFDDTMTHGGYSDHMVCAEDFIIR,sno,C,140,true,"Site-specific nitrosomeproteomic id - gsnor1-3",90a,25699590,XCorr,3.3482585,,,,,1.3060000192411E-8,-6.1679272
NFDDTMTHGGYSDHMVCAEDFIIR,sno,C,140,true,"Site-specific nitrosomeproteomic id - gsnor1-3",90b,25699590,XCorr,3.6000000,,,,,2.8350000320643E-6,-6.0500000
MVVGSMVGGIK,mox,M,293,true,"cat2 Methionine oxidation - 3h stress",62b,25693801,"MASCOT Score",55.0000000,,0.0947555,,NO,,
MVVGSMVGGIK,mox,M,298,true,"cat2 Methionine oxidation - 3h stress",62b,25693801,"MASCOT Score",55.0000000,,0.0947555,,NO,,
FVIDVANTMKPTP,ub,K,354,true,"upl3 mutant / wildtype",168,35926874,"MaxQuant score",48.5680000,1.0000000,,,,0.015531400218606,-2.6353000
FVIDVANTMKPTP,ph,T,356,true,"Tissue atlas Arabidopsis - ProteomicsDB",114,32188942,"MaxQuant score",123.1000000,0.9992170,,,,0.00038691799272783,
