Peptide,PTM,ModifiedAA,ModifiedPosition,PeptideUniqueToGene,ExperimentDesc,ExpID,PubmedID,ScoreType,IdentScore,LocProb,Log2FChange,PQ-val,QuantSig,PEP,MassErrorPPM
LSSSIDKPIRPLIR,ph,S,12,true,"Tissue atlas Arabidopsis - ProteomicsDB",114,32188942,"MaxQuant score",116.8600000,0.9995830,,,,1.5680900105508E-5,
LSSSIDKPIR,ph,S,12,true,"atm and atr DNA damage response",88,25561503,"MASCOT Score",29.0000000,1.0000000,,,,,-0.4100000
LSSSIDKPIRPLIR,ph,S,13,true,"Tissue atlas Arabidopsis - ProteomicsDB",114,32188942,"MaxQuant score",76.8500000,0.8976500,,,,0.00021086899505462,
LSSSIDKPIR,ph,S,13,true,"atm and atr DNA damage response",88,25561503,"MASCOT Score",27.0000000,0.9900000,,,,,-0.9800000
STSCYMSSLPSEAVDEK,ph,S,26,true,"srk2dei ABA signaling phopshoproteomics",83,23572148,"MASCOT Score",46.0000000,,,,,,0.0006000
STSCYMSSLPSEAVDEK,ph,S,26,true,"Tissue atlas Arabidopsis - ProteomicsDB",114,32188942,"MaxQuant score",117.1800000,0.9531090,,,,9.731400130164E-10,
SSLPSEAVDEKER,nt,S,30,true,"N-terminal ChaFRADIC",92,26010716,"MASCOT Score",39.7900000,,,,,1.9679999851974E-8,
SSLPSEAVDEKER,nt,S,30,true,"Stromal N-terminome",96,26371235,"MASCOT Score",42.9400000,,,,,,
SSLPSEAVDEKER,nt,S,30,true,"FtsH12 N-terminome: WT / FtsH12 knockdown miRNA",118,33216923,"MaxQuant score",115.8700000,,-0.3968637,0.0671876,NO,4.4899999129445E-36,
SSLPSEAVDEKER,nt,S,30,true,"Mitochondrial intermediate peptidases - oct1-1 / WT",131b,25732537,,105.5400000,,-1.2429650,,,,
SSLPSEAVDEKER,nt,S,30,true,"Mitochondrial intermediate peptidases - oct1-2 / WT",131c,25732537,,89.8900000,,-0.7866354,,,,
SSLPSEAVDEKE,nt,S,30,true,"N-terminal ChaFRADIC",92,26010716,"MASCOT Score",34.2000000,,,,,3.2880001299418E-7,
SSLPSEAVDE,nt,S,30,true,"N-terminal ChaFRADIC",92,26010716,"MASCOT Score",61.2000000,,,,,0.0018019999843091,
SSLPSEAVDEKER,nta,S,30,true,"Mitochondrial intermediate peptidases - oct1-1 / WT",131b,25732537,,73.7300000,,-0.1101365,,,,
SSLPSEAVDEKER,nta,S,30,true,"Mitochondrial intermediate peptidases - oct1-2 / WT",131c,25732537,,92.5700000,,-0.4819613,,,,
SLPSEAVDEKER,nt,S,31,true,"N-terminal ChaFRADIC",92,26010716,"MASCOT Score",43.2300000,,,,,4.082999964794E-7,
SLPSEAVDEKER,nt,S,31,true,"Stromal N-terminome",96,26371235,"MASCOT Score",58.2200000,,,,,,
SLPSEAVDEKE,nt,S,31,true,"N-terminal ChaFRADIC",92,26010716,"MASCOT Score",40.8300000,,,,,3.6279998312239E-5,
SLPSEAVDEK,nt,S,31,true,"N-terminal ChaFRADIC",92,26010716,"MASCOT Score",44.6000000,,,,,1.0300000212737E-6,
SLPSEAVDE,nt,S,31,true,"N-terminal ChaFRADIC",92,26010716,"MASCOT Score",56.6200000,,,,,0.0038519999943674,
SLPSEAVDE,nt,S,31,true,"Arg/N-end rule seed, prt6 vs. Wt",99,29168982,"MASCOT Score",56.5500000,,0.2341115,0.2104724,NO,0.020870000123978,-1.3077439
SLPSEAVDEKER,nta,S,31,true,"FtsH12 N-terminome: WT / FtsH12 knockdown miRNA",118,33216923,"MaxQuant score",66.5950000,,0.0570851,0.6600642,NO,1.4300000644796E-16,
SLPSEAVDEKE,nta,S,31,true,"N-terminal ChaFRADIC",92,26010716,"MASCOT Score",32.2700000,,,,,0.010060000233352,
SRVTWPK,ph,T,46,true,"SIRK1 phosphorylation",86a,23820729,"MaxQuant Score",122.6400000,1.0000000,,,,0.029999999329448,1.4710000
SRVTWPK,ph,T,46,true,"SIRK1 exp - sirk1 mutant vs WT",86b,23820729,,,,-0.7931790,,NO,,
SRVTWPK,ph,T,46,true,"SIRK1 exp - 35S:SIRK1 vs WT",86c,23820729,,,,-1.7304158,,NO,,
QLNAPLEEVDPEIADIIEHEKAR,nt,Q,50,true,"HUNTER N-terminome: legumain, GluC and trypsin",119,31951383,"MaxQuant score",,,,,,,
YYGGNEYIDMAETLCQK,sno,C,125,false,"Site-specific nitrosomeproteomic id - gsnor1-3",90b,25699590,XCorr,3.1500000,,,,,7.717999687884E-5,-7.4500000
YYGGNEYIDMAETLCQK,sno,C,125,false,"hot5-4 / wildtype, FAT-switch S-nitrosoproteome",169,37277371,,,,0.2112897,0.0015647,NO,,
STGYIDYDQME,nt,S,206,true,"N-terminal ChaFRADIC",92,26010716,"MASCOT Score",75.7000000,,,,,8.9790000856738E-6,
SATLFRPK,ac,K,225,true,"Quantitative Acetylproteomics",101,29440448,,,,,,,,
LIVAGASAYAR,ph,S,232,false,"Tissue atlas Arabidopsis - ProteomicsDB",114,32188942,"MaxQuant score",71.5580000,0.9993260,,,,0.0024288599379361,
DVVTTTTHKSLR,nt,D,278,false,"Arg/N-end rule seed, prt6 vs. Wt",99,29168982,"MASCOT Score",24.7100000,,-0.4330454,0.3157365,NO,0.13779999315739,-1.3215718
QGKEVLYDFEDK,ac,K,310,true,"Histone deacetylases substrates - hda14 vs WT",98e,29061669,"MaxQuant Score",117.7000000,1.0000000,0.1150000,0.9099133,NO,3.4999999597567E-16,
QAVFPGLQGGPHN,nt,Q,322,false,"HUNTER N-terminome: legumain, GluC and trypsin",119,31951383,"MaxQuant score",142.4300000,,,,,,
QVLSNSAKFAQTLME,nt,Q,358,true,"HUNTER N-terminome: legumain, GluC and trypsin",119,31951383,"MaxQuant score",106.7900000,,,,,,
VEKVLEAVHIASNK,ac,K,403,true,"Histone deacetylases substrates - TSA vs control",98b,29061669,"MaxQuant Score",97.8000000,1.0000000,0.1670000,0.9977001,NO,1.3000000080865E-6,
VEKVLEAVHIASNK,hib,K,403,true,"Open search Plant PTM Viewer 2.0 - hib",164e,TBA,,,,,,,,
VAEYFDKAVTIALK,cr,K,455,true,"Open search Plant PTM Viewer 2.0 - Crotonylation",164c,TBA,,,,,,,,
VKSEAQGTK,ac,K,464,true,"Quantitative Acetylproteomics",101,29440448,,,,,,,,
VKSEAQGTKLK,ac,K,471,true,"Quantitative Acetylproteomics",101,29440448,,,,,,,,
SEAQGTKLK,ac,K,471,true,"Histone deacetylases - apicidin vs control",98a,29061669,"MaxQuant Score",112.7000000,1.0000000,0.0070000,0.9749896,NO,0.0040000001899898,
SEAQGTKLK,ac,K,471,true,"Histone deacetylases- hda14 vs WT (low light)",98c,29061669,"MaxQuant Score",101.1200000,1.0000000,0.5570000,0.9885531,NO,0.018999999389052,
SEAQGTKLK,ac,K,471,true,"Quantitative Acetylproteomics",101,29440448,,,,,,,,
