Peptide,PTM,ModifiedAA,ModifiedPosition,PeptideUniqueToGene,ExperimentDesc,ExpID,PubmedID,ScoreType,IdentScore,LocProb,Log2FChange,PQ-val,QuantSig,PEP,MassErrorPPM
SAGNGNATNGDGGFSFPKGPVMPKITTGAAKR,nt,S,2,true,"FtsH12 N-terminome: WT / FtsH12 knockdown miRNA",118,33216923,"MaxQuant score",52.9270000,,,,,0.011532999575138,
SAGNGNATNGDGGFSFPKGPVMPKITTG,nt,S,2,true,"Arg/N-end rule seed, prt6 vs. Wt",99,29168982,"MASCOT Score",27.6200000,,,,,0.00024570000823587,0.5002822
SAGNGNATNG,nt,S,2,true,"N-term acetylation drought responses",5,26184543,,,,,,,,
SAGNGNATNGDGGFSFPKGPVMPKITTGAAKR,nta,S,2,true,"HUNTER N-terminome: legumain, GluC and trypsin",119,31951383,"MaxQuant score",122.0900000,,,,,,
SAGNGNATNGDGGFSFPKGPVMPKITTG,nta,S,2,true,"Arg/N-end rule seed, prt6 vs. Wt",99,29168982,"MASCOT Score",27.6200000,,0.7283740,0.3462556,NO,0.00024570000823587,0.5002822
SAGNGNATNGDGGFSFPK,nta,S,2,true,"Characterization plant N-terminal acetylation",6,22223895,"MASCOT Score",85.8000000,,,,,,
SAGNGNATNG,nta,S,2,true,"N-term acetylation drought responses",5,26184543,,,,,,,,
SAGNGNATNGDGGFSFPK,ph,S,2,true,"Lateral root-induction - NAA vs control",106,23328941,"MASCOT Score",22.0000000,,,,,,
SAGNGNATNGDGGFSFPK,ph,S,2,true,"Tissue atlas Arabidopsis - ProteomicsDB",114,32188942,"MaxQuant score",191.4100000,1.0000000,,,,1.4012984643248E-45,
SAGNGNATNGDGGFSFPKGPVMPK,ph,S,16,true,"Tissue atlas Arabidopsis - ProteomicsDB",114,32188942,"MaxQuant score",66.3830000,0.9947640,,,,2.1723799363826E-6,
GPVMPKITTGAAKR,nt,G,20,true,"Metacaspase9 substrates - Col-0 / mc9",51a,23964026,"MASCOT Score",76.0000000,,2.8057707,,NO,,-2.7043628
GPVMPKITTGAAKR,nt,G,20,true,"Metacaspase9 substrates - 35S:MC9 / mc9",51b,23964026,"MASCOT Score",80.0000000,,3.5791745,,NO,,-2.4639756
GPVMPKITTGAAKR,nt,G,20,true,"Metacaspase9 substrates - in vitro rMC9",51c,23964026,"MASCOT Score",49.0000000,,3.5151999,,NO,,0.0605351
ITTGAAKR,nt,I,26,true,"Metacaspase9 substrates - in vitro rMC9",51c,23964026,"MASCOT Score",49.0000000,,1.5253006,,NO,,0.4146831
RGSGVCHDDSGPTVNATTIDELHSLQK,ph,S,35,true,"TOR Kinase and ABA Receptor",100,29290610,XCorr,3.6235349,0.9984000,,,,0.00026959998649545,
RGSGVCHDDSGPTVNATTIDELHSLQK,ph,S,35,true,"Tissue atlas Arabidopsis - ProteomicsDB",114,32188942,"MaxQuant score",262.8500000,1.0000000,,,,0,
GSGVCHDDSGPTVNATTIDELHSLQK,sno,C,38,true,"hot5-4 / wildtype, FAT-switch S-nitrosoproteome",169,37277371,,,,,,,,
RGSGVCHDDSGPTVNATTIDELHSLQKK,so,C,38,true,"S-sulfenylation site detection using YAP1C",110,32714340,,,,,,,,
HDDSGPTVNATTIDE,nt,H,39,true,"Arg/N-end rule seed, prt6 vs. Wt",99,29168982,"MASCOT Score",54.8700000,,0.1649873,0.4481858,NO,1.5119999696722E-10,-0.1913855
GSGVCHDDSGPTVNATTIDELHSLQK,ph,S,42,true,"Tissue atlas Arabidopsis - ProteomicsDB",114,32188942,"MaxQuant score",138.9300000,0.9920180,,,,7.4268818609215E-43,
RGSGVCHDDSGPTVNATTIDELHSLQK,ph,S,56,true,"Tissue atlas Arabidopsis - ProteomicsDB",114,32188942,"MaxQuant score",242.1600000,1.0000000,,,,0,
KRSAPTTPINQNAAAAFAAVSEEER,ph,S,62,true,"PAMP-triggered phosphorylation",48,24601666,"MASCOT Score",109.4500000,,,,,,
KRSAPTTPINQNAAAAFAAVSEEER,ph,S,62,true,"Conserved plant phosphoproteome - Arabidopsis",61a,20466843,"MASCOT Score",70.0000000,1.0000000,,,,,
KRSAPTTPINQNAAAAFAAVSEEER,ph,S,62,true,"srk2dei ABA signaling phopshoproteomics",83,23572148,"MASCOT Score",127.0000000,,,,,,0.0006000
KRSAPTTPINQNAAAAFAAVSEEER,ph,S,62,true,"LAXIC - mannitol vs control",84b,23660473,XCorr,5.3700000,0.9980000,,,,4.3499999046065E-16,
KRSAPTTPINQNAAAAFAAVSEEER,ph,S,62,true,"SnRK2 protein kinase substrates",85,23776212,XCorr,4.6689100,0.9360000,,,,5.6731801123533E-6,
KRSAPTTPINQNAAAAFAAVSEEER,ph,S,62,true,"Brassinosteroid-Regulated Phosphorylation Dynamics",94,26187819,"MaxQuant Score",176.5700000,0.9960000,,,,8.3200695020822E-41,1.4600000
KRSAPTTPINQNAAAAFAAVSEEER,ph,S,62,true,"TOR Kinase and ABA Receptor",100,29290610,XCorr,6.6661835,0.9982000,,,,8.533000001032E-11,
SAPTTPINQNAAAAFAAVSEEERQK,ph,S,62,true,"TOR Kinase and ABA Receptor",100,29290610,XCorr,3.0880165,0.9914000,,,,0.00048869999591261,
RSAPTTPINQNAAAAFAAVSEEER,ph,S,62,true,"Arabidopsis root NAA phosphoproteome",18a,27643528,"MaxQuant Score",177.8100000,0.9920000,,,,7.9569930699756E-40,-1.0260000
RSAPTTPINQNAAAAFAAVSEEER,ph,S,62,true,"Phospho cell culture sucrose/TOR",109,30833711,,,0.9907180,,,,,
SAPTTPINQNAAAAFAAVSEEER,ph,S,62,true,"STN8 phosphoproteome",38,21768351,"MASCOT Score",48.2500000,,,,,,-0.4000270
SAPTTPINQNAAAAFAAVSEEER,ph,S,62,true,"PAMP-triggered phosphorylation",48,24601666,"MASCOT Score",115.2500000,,,,,,
SAPTTPINQNAAAAFAAVSEEER,ph,S,62,true,"Chloroplast kinase substrates",60,19376835,"MASCOT Score",41.7400000,,,,,,-0.4000270
SAPTTPINQNAAAAFAAVSEEER,ph,S,62,true,"srk2dei ABA signaling phopshoproteomics",83,23572148,"MASCOT Score",99.0000000,,,,,,0.0000000
SAPTTPINQNAAAAFAAVSEEER,ph,S,62,true,"LAXIC - mannitol vs control",84b,23660473,XCorr,5.8400000,0.9020000,1.9531756,,NO,5.8099999478145E-6,
SAPTTPINQNAAAAFAAVSEEER,ph,S,62,true,"SnRK2 protein kinase substrates",85,23776212,XCorr,4.6650009,0.9250000,,,,0.0049396702088416,
SAPTTPINQNAAAAFAAVSEEER,ph,S,62,true,"TOR Kinase and ABA Receptor",100,29290610,XCorr,5.8326383,0.9139000,,,,4.886999960263E-8,
SAPTTPINQNAAAAFAAVSEEER,ph,S,62,true,"Lateral root-induction - NAA vs control",106,23328941,"MASCOT Score",74.0000000,,,,,,
SAPTTPINQNAAAAFAAVSEEER,ph,S,62,true,"Col-0 callus - FC Col-0 vs. Col-0 Xray",111a,31410901,,127.4100000,,0.8589524,0.0000000,NO,,0.6966166
SAPTTPINQNAAAAFAAVSEEER,ph,S,62,true,"Col-0 X-ray callus - FC Col-0 vs. Col-0 Xray",111b,31410901,,127.4100000,,0.8589524,0.0000000,NO,,0.6966166
SAPTTPINQNAAAAFAAVSEEER,ph,S,62,true,"atm callus - FC atm vs. atm Xray",111c,31410901,,127.4100000,,1.2172308,0.0000000,NO,,0.6966166
SAPTTPINQNAAAAFAAVSEEER,ph,S,62,true,"atm-3 X-ray callus - FC atm vs. atm Xray",111d,31410901,,127.4100000,,1.2172308,0.0000000,NO,,0.6966166
SAPTTPINQNAAAAFAAVSEEER,ph,S,62,true,"Tissue atlas Arabidopsis - ProteomicsDB",114,32188942,"MaxQuant score",363.4900000,0.9999980,,,,0,
KRSAPTTPINQNAAAAFAAVSEEER,ph,T,65,true,"srk2dei ABA signaling phopshoproteomics",83,23572148,"MASCOT Score",94.0000000,,,,,,0.0002000
KRSAPTTPINQNAAAAFAAVSEEER,ph,T,65,true,"TOR Kinase and ABA Receptor",100,29290610,XCorr,6.6661835,0.8923000,,,,8.533000001032E-11,
KRSAPTTPINQNAAAAFAAVSEEER,ph,T,65,true,"Tissue atlas Arabidopsis - ProteomicsDB",114,32188942,"MaxQuant score",287.5900000,0.8557160,,,,0,
RSAPTTPINQNAAAAFAAVSEEER,ph,T,65,true,"Phospho cell culture sucrose/TOR",109,30833711,,,0.7581540,,,,,
SAPTTPINQNAAAAFAAVSEEER,ph,T,65,true,"PAMP-triggered phosphorylation",48,24601666,"MASCOT Score",99.7800000,,,,,,
SAPTTPINQNAAAAFAAVSEEER,ph,T,65,true,"srk2dei ABA signaling phopshoproteomics",83,23572148,"MASCOT Score",67.0000000,,,,,,-0.0005000
SAPTTPINQNAAAAFAAVSEEER,ph,T,65,true,"Lateral root-induction - NAA vs control",106,23328941,"MASCOT Score",75.0000000,,,,,,
SAPTTPINQNAAAAFAAVSEEER,ph,T,65,true,"Col-0 callus - FC Col-0 vs. Col-0 Xray",111a,31410901,,51.5800000,,1.2224503,0.0244427,YES,,0.5947534
SAPTTPINQNAAAAFAAVSEEER,ph,T,65,true,"Col-0 X-ray callus - FC Col-0 vs. Col-0 Xray",111b,31410901,,51.5800000,,1.2224503,0.0244427,YES,,0.5947534
SAPTTPINQNAAAAFAAVSEEER,ph,T,65,true,"atm callus - FC atm vs. atm Xray",111c,31410901,,51.5800000,,0.7877160,0.0711794,NO,,0.5947534
SAPTTPINQNAAAAFAAVSEEER,ph,T,65,true,"atm-3 X-ray callus - FC atm vs. atm Xray",111d,31410901,,51.5800000,,0.7877160,0.0711794,NO,,0.5947534
KRSAPTTPINQNAAAAFAAVSEEER,ph,T,66,true,"PAMP-triggered phosphorylation",48,24601666,"MASCOT Score",81.2700000,,,,,,
KRSAPTTPINQNAAAAFAAVSEEER,ph,T,66,true,"srk2dei ABA signaling phopshoproteomics",83,23572148,"MASCOT Score",127.0000000,,,,,,0.0006000
KRSAPTTPINQNAAAAFAAVSEEER,ph,T,66,true,"LAXIC - mannitol vs control",84b,23660473,XCorr,5.3700000,0.8850000,,,,4.3499999046065E-16,
KRSAPTTPINQNAAAAFAAVSEEER,ph,T,66,true,"SnRK2 protein kinase substrates",85,23776212,XCorr,4.6689100,0.9360000,,,,5.6731801123533E-6,
RSAPTTPINQNAAAAFAAVSEEER,ph,T,66,true,"Phospho cell culture sucrose/TOR",109,30833711,,,0.8462250,,,,,
RSAPTTPINQNAAAAFAAVSEEER,ph,T,66,true,"Col-0 callus - FC Col-0 vs. Col-0 Xray",111a,31410901,,25.9600000,,0.7387877,0.0000000,NO,,-0.0650343
RSAPTTPINQNAAAAFAAVSEEER,ph,T,66,true,"Col-0 X-ray callus - FC Col-0 vs. Col-0 Xray",111b,31410901,,25.9600000,,0.7387877,0.0000000,NO,,-0.0650343
RSAPTTPINQNAAAAFAAVSEEER,ph,T,66,true,"atm callus - FC atm vs. atm Xray",111c,31410901,,25.9600000,,1.8054392,0.0000000,NO,,-0.0650343
RSAPTTPINQNAAAAFAAVSEEER,ph,T,66,true,"atm-3 X-ray callus - FC atm vs. atm Xray",111d,31410901,,25.9600000,,1.8054392,0.0000000,NO,,-0.0650343
SAPTTPINQNAAAAFAAVSEEER,ph,T,66,true,"Arabidopsis root NAA phosphoproteome",18a,27643528,"MaxQuant Score",135.3000000,0.9630000,,,,2.4440000457872E-25,-0.2860000
SAPTTPINQNAAAAFAAVSEEER,ph,T,66,true,"PAMP-triggered phosphorylation",48,24601666,"MASCOT Score",115.2500000,,,,,,
SAPTTPINQNAAAAFAAVSEEER,ph,T,66,true,"srk2dei ABA signaling phopshoproteomics",83,23572148,"MASCOT Score",91.0000000,,,,,,-0.0017000
SAPTTPINQNAAAAFAAVSEEER,ph,T,66,true,"SnRK2 protein kinase substrates",85,23776212,XCorr,4.6650009,0.9250000,,,,0.0049396702088416,
SAPTTPINQNAAAAFAAVSEEER,ph,T,66,true,"Lateral root-induction - NAA vs control",106,23328941,"MASCOT Score",85.0000000,,-0.3104545,0.1274777,NO,,
SAPTTPINQNAAAAFAAVSEEER,ph,T,66,true,"Col-0 callus - FC Col-0 vs. Col-0 Xray",111a,31410901,,33.2900000,,1.1320143,0.0323472,YES,,0.6497136
SAPTTPINQNAAAAFAAVSEEER,ph,T,66,true,"Col-0 X-ray callus - FC Col-0 vs. Col-0 Xray",111b,31410901,,33.2900000,,1.1320143,0.0323472,YES,,0.6497136
SAPTTPINQNAAAAFAAVSEEER,ph,T,66,true,"atm callus - FC atm vs. atm Xray",111c,31410901,,33.2900000,,0.8173006,0.0183275,YES,,0.6497136
SAPTTPINQNAAAAFAAVSEEER,ph,T,66,true,"atm-3 X-ray callus - FC atm vs. atm Xray",111d,31410901,,33.2900000,,0.8173006,0.0183275,YES,,0.6497136
SAPTTPINQNAAAAFAAVSEEER,ph,T,66,true,"Tissue atlas Arabidopsis - ProteomicsDB",114,32188942,"MaxQuant score",363.4900000,0.9989230,,,,0,
SISASLASLTRE,nt,S,91,true,"Arg/N-end rule seed, prt6 vs. Wt",99,29168982,"MASCOT Score",42.5400000,,-0.5980140,0.4524194,NO,0.0012309999438003,-0.3044896
IQLQSISASLASLTRESGPK,ph,S,91,true,"Tissue atlas Arabidopsis - ProteomicsDB",114,32188942,"MaxQuant score",44.2380000,0.9976320,,,,0.0043996698223054,
ASLASLTR,nt,A,94,false,"Arg/N-end rule seed, prt6 vs. Wt",99,29168982,"MASCOT Score",31.3700000,,-1.0013726,0.0718254,NO,0.22579999268055,0.3692482
IQLQSISASLASLTRESGPK,ph,S,95,true,"Tissue atlas Arabidopsis - ProteomicsDB",114,32188942,"MaxQuant score",44.2380000,0.9774560,,,,0.0043996698223054,
IQLQSISASLASLTRESGPK,ph,S,98,true,"Tissue atlas Arabidopsis - ProteomicsDB",114,32188942,"MaxQuant score",44.2380000,0.9971540,,,,0.0043996698223054,
IQLQSISASLASLTRESGPK,ph,T,100,true,"Tissue atlas Arabidopsis - ProteomicsDB",114,32188942,"MaxQuant score",44.2380000,0.9971540,,,,0.0043996698223054,
ESGPKVVR,nt,E,102,true,"Metacaspase9 substrates - 35S:MC9 / mc9",51b,23964026,"MASCOT Score",43.0000000,,1.3265413,,NO,,0.3926949
ESGPKVVR,nt,E,102,true,"Metacaspase9 substrates - in vitro rMC9",51c,23964026,"MASCOT Score",49.0000000,,2.4548502,,NO,,0.5937212
IQLQSISASLASLTRESGPK,ph,S,103,true,"Tissue atlas Arabidopsis - ProteomicsDB",114,32188942,"MaxQuant score",44.2380000,0.9964370,,,,0.0043996698223054,
KTDGSTTPAYAHGQHHSIFSPATGAVSDSSLK,ph,T,117,true,"Col-0 callus - FC Col-0 vs. Col-0 Xray",111a,31410901,,25.7200000,,-0.0325990,0.0000000,NO,,1.1673119
KTDGSTTPAYAHGQHHSIFSPATGAVSDSSLK,ph,T,117,true,"Col-0 X-ray callus - FC Col-0 vs. Col-0 Xray",111b,31410901,,25.7200000,,-0.0325990,0.0000000,NO,,1.1673119
KTDGSTTPAYAHGQHHSIFSPATGAVSDSSLK,ph,T,117,true,"atm callus - FC atm vs. atm Xray",111c,31410901,,25.7200000,,0.8660718,0.0000000,NO,,1.1673119
KTDGSTTPAYAHGQHHSIFSPATGAVSDSSLK,ph,T,117,true,"atm-3 X-ray callus - FC atm vs. atm Xray",111d,31410901,,25.7200000,,0.8660718,0.0000000,NO,,1.1673119
TDGSTTPAYAHGQHHSIFSPATGAVSDSSLK,ph,T,117,true,"Large-scale phosphorylation discovery",44,23111157,XCorr,3.9320000,,,,,,
TDGSTTPAYAHGQHHSIFSPATGAVSDSSLK,ph,T,117,true,"PAMP-triggered phosphorylation",48,24601666,"MASCOT Score",56.2500000,,,,,,
KTDGSTTPAYAHGQHHSIFSPATGAVSDSSLK,ph,S,120,true,"srk2dei ABA signaling phopshoproteomics",83,23572148,"MASCOT Score",45.0000000,,,,,,-0.0029000
TDGSTTPAYAHGQHHSIFSPATGAVSDSSLK,ph,S,120,true,"Tissue atlas Arabidopsis - ProteomicsDB",114,32188942,"MaxQuant score",330.1800000,0.7606120,,,,0,
KTDGSTTPAYAHGQHHSIFSPATGAVSDSSLK,ph,T,121,true,"PAMP-triggered phosphorylation",48,24601666,"MASCOT Score",29.9400000,,,,,,
TDGSTTPAYAHGQHHSIFSPATGAVSDSSLK,ph,T,121,true,"Arabidopsis root NAA phosphoproteome",18a,27643528,"MaxQuant Score",137.5700000,0.8140000,,,,1.5490000319954E-26,0.3240000
TDGSTTPAYAHGQHHSIFSPATGAVSDSSLK,ph,T,121,true,"Lateral root-induction - NAA vs control",106,23328941,"MASCOT Score",39.0000000,,,,,,
TDGSTTPAYAHGQHHSIFSPATGAVSDSSLK,ph,T,121,true,"Phospho cell culture sucrose/TOR",109,30833711,,,0.8111180,,,,,
TDGSTTPAYAHGQHHSIFSPATGAVSDSSLK,ph,T,121,true,"Tissue atlas Arabidopsis - ProteomicsDB",114,32188942,"MaxQuant score",382.3800000,0.8410320,,,,0,
KTDGSTTPAYAHGQHHSIFSPATGAVSDSSLK,ph,T,122,true,"Arabidopsis root NAA phosphoproteome",18a,27643528,"MaxQuant Score",104.3900000,0.8440000,,,,7.5570002729466E-14,0.1740000
KTDGSTTPAYAHGQHHSIFSPATGAVSDSSLK,ph,T,122,true,"PAMP-triggered phosphorylation",48,24601666,"MASCOT Score",81.4000000,,,,,,
KTDGSTTPAYAHGQHHSIFSPATGAVSDSSLK,ph,T,122,true,"srk2dei ABA signaling phopshoproteomics",83,23572148,"MASCOT Score",59.0000000,,,,,,0.0001000
KTDGSTTPAYAHGQHHSIFSPATGAVSDSSLK,ph,T,122,true,"Phospho cell culture sucrose/TOR",109,30833711,,,0.9217930,,,,,
KTDGSTTPAYAHGQHHSIFSPATGAVSDSSLK,ph,T,122,true,"Tissue atlas Arabidopsis - ProteomicsDB",114,32188942,"MaxQuant score",382.3800000,0.9928070,,,,0,
TDGSTTPAYAHGQHHSIFSPATGAVSDSSLK,ph,T,122,true,"PAMP-triggered phosphorylation",48,24601666,"MASCOT Score",64.5700000,,,,,,
TDGSTTPAYAHGQHHSIFSPATGAVSDSSLK,ph,T,122,true,"Col-0 callus - FC Col-0 vs. Col-0 Xray",111a,31410901,,48.4800000,,0.4334619,0.0000000,NO,,1.1670812
TDGSTTPAYAHGQHHSIFSPATGAVSDSSLK,ph,T,122,true,"Col-0 X-ray callus - FC Col-0 vs. Col-0 Xray",111b,31410901,,48.4800000,,0.4334619,0.0000000,NO,,1.1670812
TDGSTTPAYAHGQHHSIFSPATGAVSDSSLK,ph,T,122,true,"atm callus - FC atm vs. atm Xray",111c,31410901,,48.4800000,,1.1489865,0.0000000,NO,,1.1670812
TDGSTTPAYAHGQHHSIFSPATGAVSDSSLK,ph,T,122,true,"atm-3 X-ray callus - FC atm vs. atm Xray",111d,31410901,,48.4800000,,1.1489865,0.0000000,NO,,1.1670812
KTDGSTTPAYAHGQHHSIFSPATGAVSDSSLK,ph,Y,125,true,"Col-0 callus - FC Col-0 vs. Col-0 Xray",111a,31410901,,35.6700000,,0.1401647,0.0000000,NO,,1.1676566
KTDGSTTPAYAHGQHHSIFSPATGAVSDSSLK,ph,Y,125,true,"Col-0 X-ray callus - FC Col-0 vs. Col-0 Xray",111b,31410901,,35.6700000,,0.1401647,0.0000000,NO,,1.1676566
KTDGSTTPAYAHGQHHSIFSPATGAVSDSSLK,ph,Y,125,true,"atm callus - FC atm vs. atm Xray",111c,31410901,,35.6700000,,1.0333210,0.0000000,NO,,1.1676566
KTDGSTTPAYAHGQHHSIFSPATGAVSDSSLK,ph,Y,125,true,"atm-3 X-ray callus - FC atm vs. atm Xray",111d,31410901,,35.6700000,,1.0333210,0.0000000,NO,,1.1676566
KTDGSTTPAYAHGQHHSIFSPATGAVSDSSLK,ph,Y,125,true,"Tissue atlas Arabidopsis - ProteomicsDB",114,32188942,"MaxQuant score",158.5700000,0.8891970,,,,0,
TDGSTTPAYAHGQHHSIFSPATGAVSDSSLK,ph,Y,125,true,"TOR Kinase and ABA Receptor",100,29290610,XCorr,4.5506539,0.8784000,,,,0.00029910000739619,
QHHSIFSPATGAVSD,nt,Q,129,true,"HUNTER N-terminome: legumain, GluC and trypsin",119,31951383,"MaxQuant score",42.0010000,,,,,,
KTDGSTTPAYAHGQHHSIFSPATGAVSDSSLK,ph,S,132,true,"Ethylene-regulated phosphorylation ein2 mutant",30,19253305,"MASCOT Score",30.6878000,,,,,,1.0982401
KTDGSTTPAYAHGQHHSIFSPATGAVSDSSLK,ph,S,132,true,"srk2dei ABA signaling phopshoproteomics",83,23572148,"MASCOT Score",32.0000000,,,,,,-0.0006000
KTDGSTTPAYAHGQHHSIFSPATGAVSDSSLK,ph,S,132,true,"TOR Kinase and ABA Receptor",100,29290610,XCorr,4.6986437,0.9805000,,,,3.4730001061689E-6,
KTDGSTTPAYAHGQHHSIFSPATGAVSDSSLK,ph,S,132,true,"Tissue atlas Arabidopsis - ProteomicsDB",114,32188942,"MaxQuant score",174.5300000,0.9713550,,,,0,
KTDGSTTPAYAHGQHHSIFSPATGAVSDSSLK,ph,S,135,true,"TOR Kinase and ABA Receptor",100,29290610,XCorr,4.6986437,0.9855000,,,,3.4730001061689E-6,
KTDGSTTPAYAHGQHHSIFSPATGAVSDSSLK,ph,S,135,true,"Tissue atlas Arabidopsis - ProteomicsDB",114,32188942,"MaxQuant score",269.0500000,0.9999990,,,,0,
KTDGSTTPAYAHGQHHSIFSPATGAVSDSSLK,ph,S,142,true,"Tissue atlas Arabidopsis - ProteomicsDB",114,32188942,"MaxQuant score",169.1000000,0.9075520,,,,0,
GSFITSNGALATLSGAK,ph,S,183,true,"Tissue atlas Arabidopsis - ProteomicsDB",114,32188942,"MaxQuant score",219.2400000,0.9168860,,,,0,
STSVDLNLAR,nt,S,309,true,"FtsH12 N-terminome: WT / FtsH12 knockdown miRNA",118,33216923,"MaxQuant score",81.3380000,,,,,0.012412000447512,
SLHSGCNMGKDGDVALF,nt,S,351,false,"Arabidopsis translation initiation landscape - NT",167b,35069635,,,,,,,,
ILSLHSGCNMGK,so,C,356,false,"S-sulfenylation site detection using YAP1C",110,32714340,,,,,,,,
YLIGDDEHCWTETGVSNIEGGCYAK,ph,Y,407,true,"Tyrosine phosphorylation - flg22 vs mock",105,22074104,"MASCOT Score",37.9900000,,,,,,-2.2812592
CVDLSR,ox,C,410,true,"OxiTRAQ Arabidopsis - 5 mM H2O2 versus control",47,24376095,,,,0.3588369,0.0102090,NO,,
CVDLSR,so,C,410,true,"S-sulfenylation site detection using YAP1C",110,32714340,,,,,,,,
EVDYSDKSVTENTR,ub,K,448,true,"Arabidopsis ubiquitination COFRADIC",40,26744219,"MaxQuant Score",67.1360000,1.0000000,,,,3.036000089196E-5,0.6140000
GYTALVAGTE,nt,G,507,false,"Arg/N-end rule seed, prt6 vs. Wt",99,29168982,"MASCOT Score",49.1900000,,0.0821305,0.6717096,NO,0.00044999999227002,-1.3639674
IKLAYTR,ub,K,576,false,"upl3 mutant / wildtype",168,35926874,"MaxQuant score",123.6900000,1.0000000,0.3617684,0.4292200,NO,0.019146399572492,-1.0782000
IIDAIHSGSLLK,ph,S,591,true,"Tissue atlas Arabidopsis - ProteomicsDB",114,32188942,"MaxQuant score",202.1300000,0.9841050,,,,1.2033899602419E-30,
SDKKAHKDTLVKLGGLF,nt,S,626,true,"Arabidopsis translation initiation landscape - NT",167b,35069635,,,,,,,,
