Peptide,PTM,ModifiedAA,ModifiedPosition,PeptideUniqueToGene,ExperimentDesc,ExpID,PubmedID,ScoreType,IdentScore,LocProb,Log2FChange,PQ-val,QuantSig,PEP,MassErrorPPM
RPAKFEDDFR,nt,R,30,true,"N-terminal ChaFRADIC",92,26010716,"MASCOT Score",26.5600000,,,,,3.3519998396514E-5,
LDPSSGCGFASK,sno,C,66,true,"Site-specific nitrosomeproteomic id - gsnor1-3",90a,25699590,XCorr,2.3193049,,,,,0.07243999838829,-7.2146921
LDPSSGCGFASK,sno,C,66,true,"hot5-4 / wildtype, FAT-switch S-nitrosoproteome",169,37277371,,,,,,,,
LIPGDSAGTVTAFYMNSDTDSVRDELDFEFLGNR,ng,N,117,true,"Conserved N-glycosylation",74,22633491,"MaxQuant Score",174.1800000,1.0000000,,,,2.9669999219997E-20,-0.1730000
VNLWFDPSR,ph,S,148,true,"Tissue atlas Arabidopsis - ProteomicsDB",114,32188942,"MaxQuant score",68.9150000,1.0000000,,,,0.011223499663174,
VYKNNEAR,ac,K,176,true,"Quantitative Acetylproteomics",101,29440448,,,,,,,,
VNHMVYDYCTDK,sno,C,276,true,"hot5-4 / wildtype, FAT-switch S-nitrosoproteome",169,37277371,,,,-0.3738642,0.1099040,NO,,
FPVPPPECSAGI,sno,C,289,true,"hot5-4 / wildtype, FAT-switch S-nitrosoproteome",169,37277371,,,,-0.3704692,0.0625974,NO,,
